program: Orca
programVersion: 5.0.4
elementType: C C H H C C H C H H H H H H C H H H H O H H
charge: 1
multiplicity: 1
keywords: wB97X-D3BJ OptTS Freq def2-TZVPP def2/J RIJCOSX VeryTightSCF
keywords: PAL8 defgrid3 VeryTightOpt
frequency: 0.00 0.00 0.00 0.00 0.00 0.00 -216.96 43.40 57.70 67.24 100.85 109.51 157.36 198.17 244.86 252.29 273.02 301.86 381.46 415.99 585.22 721.49 787.36 839.44 901.07 922.58 944.75 1052.21 1064.06 1078.20 1088.30 1141.59 1170.91 1190.77 1216.82 1240.66 1268.45 1310.25 1340.90 1349.20 1362.26 1421.05 1437.99 1457.44 1475.40 1491.56 1499.91 1509.35 1516.43 1545.82 1657.32 2661.95 3047.18 3066.07 3067.94 3087.43 3119.32 3138.37 3155.78 3168.32 3178.64 3194.06 3267.79 3310.78 3850.09 3937.42
frequency: 43.40 57.70 67.24 100.85 109.51 157.36 198.17 244.86 252.29 273.02 301.86 381.46 415.99 585.22 721.49 787.36 839.44 901.07 922.58 944.75 1052.21 1064.06 1078.20 1088.30 1141.59 1170.91 1190.77 1216.82 1240.66 1268.45 1310.25 1340.90 1349.20 1362.26 1421.05 1437.99 1457.44 1475.40 1491.56 1499.91 1509.35 1516.43 1545.82 1657.32 2661.95 3047.18 3066.07 3067.94 3087.43 3119.32 3138.37 3155.78 3168.32 3178.64 3194.06 3267.79 3310.78 3850.09 3937.42
formula: C6H15O
InChI: InChI=1/C6H13.H2O/c1-3-5-6-4-2;/h1,3-6H2,2H3;1H2
22 atoms
C  -7.29471 0.624304 -0.194996
C  -5.896846 0.537222 -0.794851
H  -7.327663 0.025676 0.721066
H  -7.982354 0.152932 -0.901964
C  -7.723177 2.061182 0.092697
C  -5.337725 -0.925541 -0.929551
H  -6.045994 -1.658515 -0.564504
C  -4.498078 -0.286673 0.033087
H  -4.913699 -1.136356 -1.902263
H  -4.717626 -0.366067 1.089689
H  -3.551555 0.148553 -0.259442
H  -5.232008 1.145597 -0.082392
H  -5.702471 1.070925 -1.722801
H  -7.026085 2.512449 0.808051
C  -9.144252 2.1283 0.64379
H  -7.653308 2.65029 -0.826955
H  -9.231665 1.568951 1.578045
H  -9.860355 1.711311 -0.067649
H  -9.434137 3.159946 0.843227
O  -2.806442 -2.052077 0.820932
H  -2.735598 -2.960056 0.515166
H  -2.099979 -1.952153 1.464747
totalener: -312.84193249 hartree
nucrepener: 312.37194963 hartree
electener: -625.21388212 hartree
oneelecener: -1030.03924618 hartree
twoeener: 404.82536407 hartree
kineticenergy: 311.30676457 hartree
exchangeener: -29.392486232316 hartree
correlationener: -2.325829519918 hartree
xcener: -31.718315752234 hartree
dispersion: -0.027306046 hartree
temp: 298.15 k
press: 1.00 atm
thermalcorrenthalpy: 0.00094421 hartree
totalenthalpy: -312.65560849 hartree
vibrat: 0.01532912 hartree
rotat: 0.01376117 hartree
transl: 0.01891565 hartree
total: 0.04800594 hartree
totalentropycorr: -0.04800594 hartree
gibbsenthalpy: -312.70361442 hartree
gibbsminuselec: 0.16562412 hartree
dispersion: -0.027316532 hartree
dispersion: -0.027315015 hartree
dispersion: -0.027315036 hartree
chargesum: 1.0000000
charge: -0.151495 -0.018308 0.080970 0.112282 -0.117306 -0.102544 0.135461 -0.012264 0.147453 0.189371 0.195735 0.144035 0.151645 0.073444 -0.258180 0.088885 0.086839 0.092691 0.111631 -0.441416 0.244917 0.246154
charge: -0.006279 0.096074 0.033401 0.040198 -0.034111 0.079011 0.047384 0.231897 0.042895 0.052180 0.051461 0.103588 0.058688 0.019074 0.019280 0.024204 0.015063 0.017000 0.020991 0.309610 -0.111167 -0.110443
qa: -0.1515 -0.0183 0.0810 0.1123 -0.1173 -0.1025 0.1355 -0.0123 0.1475 0.1894 0.1957 0.1440 0.1516 0.0734 -0.2582 0.0889 0.0868 0.0927 0.1116 -0.4414 0.2449 0.2462
va: 3.9056 3.8717 1.0077 1.0038 3.8933 3.9089 1.0164 3.7030 1.0127 0.9972 0.9959 1.0039 1.0093 1.0073 3.9580 1.0025 1.0011 1.0023 1.0024 2.0552 1.0083 1.0061
dispersion: -0.027315035 hartree
energy: -312.869208761027 hartree
dipole: -3.35523 5.10297 1.74775 2.52729 -3.39699 -0.86970 0.65850 -0.88427 -0.22577
magnitude: 1.96519 au
magnitude: 4.99512 debye
quadrupole: 953.54507 -969.07899 -15.53392 501.72714 -523.87372 -22.14659 119.96383 -148.38065 -28.41682 -612.60669 602.47544 -10.13125 16.67407 -13.71756 2.95651 -4.63168 3.58823 -1.04345
zeropoint: 0.20148938 hartree
thermalvibcorrection: 0.00845477 hartree
thermalrotcorrection: 0.00141627 hartree
thermaltrasncorrection: 0.00141627 hartree
thermaltotal: -312.65643207 hartree
thermalcorr: 0.01128731 hartree
nonthermalcorr: 0.20148938 hartree
totalcorr: 0.21277669 hartree
totalenthalpy: -312.65548786 hartree
vibrat: 0.01534441 hartree
rotat: 0.01375467 hartree
total: 0.04801473 hartree
