program: Orca
programVersion: 5.0.4
elementType: C C H H C C H C H H H H H H C H H H H O H H
charge: 1
multiplicity: 1
keywords: wB97X-D3BJ OptTS Freq def2-TZVPP def2/J RIJCOSX VeryTightSCF
keywords: PAL8 defgrid3 VeryTightOpt
frequency: 0.00 0.00 0.00 0.00 0.00 0.00 -330.23 72.95 77.71 96.88 149.01 159.48 163.51 226.98 267.88 302.99 310.91 409.86 412.60 539.57 681.03 768.54 814.23 875.78 895.25 968.20 982.06 999.49 1015.00 1046.05 1064.00 1115.25 1149.77 1195.71 1232.55 1253.42 1302.89 1307.75 1324.07 1351.73 1376.68 1418.18 1439.45 1469.16 1476.61 1486.03 1503.02 1507.74 1511.01 1523.46 1646.57 2357.40 3053.25 3063.69 3095.11 3098.12 3111.93 3112.48 3134.43 3159.44 3161.73 3171.98 3174.88 3291.44 3834.28 3926.49
frequency: 72.95 77.71 96.88 149.01 159.48 163.51 226.98 267.88 302.99 310.91 409.86 412.60 539.57 681.03 768.54 814.23 875.78 895.25 968.20 982.06 999.49 1015.00 1046.05 1064.00 1115.25 1149.77 1195.71 1232.55 1253.42 1302.89 1307.75 1324.07 1351.73 1376.68 1418.18 1439.45 1469.16 1476.61 1486.03 1503.02 1507.74 1511.01 1523.46 1646.57 2357.40 3053.25 3063.69 3095.11 3098.12 3111.93 3112.48 3134.43 3159.44 3161.73 3171.98 3174.88 3291.44 3834.28 3926.49
formula: C6H15O
InChI: InChI=1/C6H13.H2O/c1-3-5-6-4-2;/h1,3-6H2,2H3;1H2
22 atoms
C  -6.958198 0.745083 -0.416219
C  -5.739181 0.882484 -1.326015
H  -6.56726 0.227021 0.561805
H  -7.656588 -0.008778 -0.789639
C  -7.656083 2.004967 0.046076
C  -4.984983 -0.421964 -1.051882
H  -5.399111 -1.258532 -1.613819
C  -5.235585 -0.595841 0.413682
H  -3.913048 -0.355796 -1.236447
H  -5.720014 -1.466151 0.838039
H  -4.764562 0.091308 1.108879
H  -5.135446 1.737276 -1.013976
H  -6.009789 1.022632 -2.37128
H  -6.92451 2.686073 0.488966
C  -8.812869 1.745048 1.004955
H  -8.018948 2.495931 -0.865203
H  -8.465206 1.267693 1.925121
H  -9.565552 1.097878 0.549878
H  -9.29966 2.679352 1.28337
O  -3.338155 -1.834021 0.828919
H  -3.054606 -2.57582 0.286369
H  -2.996377 -2.005642 1.71155
totalener: -312.83047380 hartree
nucrepener: 319.52445883 hartree
electener: -632.35493263 hartree
oneelecener: -1044.29117672 hartree
twoeener: 411.93624410 hartree
kineticenergy: 311.27063039 hartree
exchangeener: -29.378174768079 hartree
correlationener: -2.324724194192 hartree
xcener: -31.702898962272 hartree
dispersion: -0.028376305 hartree
temp: 298.15 k
press: 1.00 atm
thermalcorrenthalpy: 0.00094421 hartree
totalenthalpy: -312.64676096 hartree
vibrat: 0.01414747 hartree
rotat: 0.01375336 hartree
transl: 0.01891565 hartree
total: 0.04681648 hartree
totalentropycorr: -0.04681648 hartree
gibbsenthalpy: -312.69357744 hartree
gibbsminuselec: 0.16527266 hartree
dispersion: -0.028342926 hartree
dispersion: -0.028387055 hartree
dispersion: -0.028506884 hartree
dispersion: -0.028649504 hartree
dispersion: -0.028786734 hartree
dispersion: -0.028846076 hartree
dispersion: -0.028932064 hartree
dispersion: -0.028983453 hartree
dispersion: -0.029009801 hartree
dispersion: -0.029060317 hartree
dispersion: -0.029128978 hartree
dispersion: -0.029116162 hartree
dispersion: -0.029253990 hartree
dispersion: -0.029239441 hartree
dispersion: -0.029278314 hartree
dispersion: -0.029250070 hartree
dispersion: -0.029193427 hartree
dispersion: -0.029214152 hartree
dispersion: -0.029241691 hartree
dispersion: -0.029218332 hartree
dispersion: -0.029218478 hartree
dispersion: -0.029207947 hartree
dispersion: -0.029223653 hartree
dispersion: -0.029201639 hartree
dispersion: -0.029208614 hartree
dispersion: -0.029202882 hartree
dispersion: -0.029216713 hartree
dispersion: -0.029213170 hartree
dispersion: -0.029213800 hartree
chargesum: 1.0000000
charge: -0.052119 -0.160609 0.026128 0.140815 -0.114481 -0.124943 0.123690 0.020233 0.137789 0.218579 0.200764 0.115620 0.127760 0.083321 -0.248318 0.106716 0.081140 0.094742 0.118508 -0.405834 0.257651 0.252850
charge: 0.047551 0.017187 0.071465 0.044215 -0.021137 -0.003768 0.037421 0.292657 0.042282 0.037571 0.047290 0.035833 0.034322 0.027532 0.019345 0.043393 0.012128 0.017745 0.024259 0.370117 -0.098762 -0.098647
qa: -0.0521 -0.1606 0.0261 0.1408 -0.1145 -0.1249 0.1237 0.0202 0.1378 0.2186 0.2008 0.1156 0.1278 0.0833 -0.2483 0.1067 0.0811 0.0947 0.1185 -0.4058 0.2577 0.2528
va: 3.8091 3.8892 1.0216 1.0025 3.9184 3.8472 1.0103 3.5214 1.0178 0.9732 0.9795 1.0126 1.0111 1.0069 3.9372 1.0036 1.0043 1.0022 1.0031 2.1234 0.9977 1.0005
dispersion: -0.029213019 hartree
energy: -312.856110058986 hartree
dipole: -3.01545 4.16520 1.14975 1.34037 -2.66139 -1.32102 1.07302 -0.69590 0.37712
magnitude: 1.79143 au
magnitude: 4.55346 debye
quadrupole: 709.19064 -728.74474 -19.55410 420.02602 -440.75280 -20.72678 193.32165 -220.28344 -26.96180 -476.22180 464.80396 -11.41784 -33.80170 36.99370 3.19199 -35.27818 32.56724 -2.71094
zeropoint: 0.20193146 hartree
thermalvibcorrection: 0.00759627 hartree
thermalrotcorrection: 0.00141627 hartree
thermaltrasncorrection: 0.00141627 hartree
thermaltotal: -312.64374979 hartree
thermalcorr: 0.01042881 hartree
nonthermalcorr: 0.20193146 hartree
totalcorr: 0.21236027 hartree
totalenthalpy: -312.64280558 hartree
vibrat: 0.01345347 hartree
rotat: 0.01370243 hartree
total: 0.04607155 hartree
