program: Orca
programVersion: 5.0.3
elementType: N C C C C C H H C C O O O O C C C C C C C C H H H H H Y N C C C C C H H C C O O O O C C C C C C C C H H H H H N C C C C C H H C C O O O O C C C C C C C C H H H H H
elementType: Y
charge: -3
multiplicity: 1
keywords: RKS CAM-B3LYP D3BJ DEF2-TZVP OPT
formula: C45H21N3O12Y
InChI: InChI=1/3C15H7NO4.Y/c3*17-14(18)12-8-11(9-13(16-12)15(19)20)7-6-10-4-2-1-3-5-10;/h3*1-5,8-9H;/q3*-3;+9/rC45H21N3O12Y/c49-40-34-22-31(19-16-28-10-4-1-5-11-28)23-35-41(50)56-61(55-40,46(34)35,47-36(42(51)57-61)24-32(25-37(47)43(52)58-61)20-17-29-12-6-2-7-13-29)48-38(44(53)59-61)26-33(27-39(48)45(54)60-61)21-18-30-14-8-3-9-15-30/h1-15,22-27H
82 atoms
N  -6.656954 -4.529002 -5.197925
C  -5.582601 -4.454976 -4.430669
C  -5.591141 -3.739201 -3.248825
C  -6.7723 -3.106048 -2.865719
C  -7.890654 -3.206262 -3.687515
C  -7.787048 -3.933398 -4.858035
H  -4.691964 -3.703944 -2.652825
H  -8.834415 -2.74255 -3.443734
C  -4.362328 -5.240957 -4.908993
C  -8.958381 -4.119298 -5.823985
O  -3.324618 -5.119837 -4.255098
O  -4.585904 -5.945375 -5.926094
O  -9.992725 -3.495102 -5.570513
O  -8.718332 -4.901598 -6.778049
C  -6.820612 -2.387616 -1.634674
C  -6.845738 -1.802826 -0.584715
C  -6.871989 -1.145059 0.673646
C  -5.687204 -0.878593 1.366408
C  -5.714672 -0.245675 2.59419
C  -6.921046 0.13649 3.160066
C  -8.101857 -0.123202 2.482549
C  -8.08144 -0.75509 1.254266
H  -4.748234 -1.180194 0.923366
H  -6.940917 0.631052 4.122763
H  -4.785056 -0.049691 3.113739
H  -9.001258 -0.962275 0.725153
H  -9.050447 0.167853 2.915955
Y  -6.66929 -6.153888 -7.120565
N  -5.661752 -8.416567 -6.730623
C  -5.975536 -9.088428 -5.635808
C  -4.773722 -8.879204 -7.594698
C  -5.383975 -10.307277 -5.349855
C  -4.440889 -10.813514 -6.24397
C  -4.137011 -10.085518 -7.391207
H  -5.65821 -10.818979 -4.439648
H  -3.413416 -10.420916 -8.117941
C  -6.985863 -8.413748 -4.701727
C  -4.481967 -7.991906 -8.804526
O  -7.369882 -7.28124 -5.091542
O  -7.296564 -9.030018 -3.679199
O  -3.684238 -8.429574 -9.637957
O  -5.106193 -6.902187 -8.802053
C  -3.758733 -12.041543 -5.997924
C  -3.138077 -13.056899 -5.824033
C  -2.37003 -14.240733 -5.660306
C  -2.456582 -15.006476 -4.493942
C  -1.69122 -16.146829 -4.339468
C  -0.822879 -16.552122 -5.341305
C  -0.729938 -15.802038 -6.503406
C  -1.492095 -14.661082 -6.6639
H  -3.130739 -14.686614 -3.711259
H  -0.222324 -17.444176 -5.217477
H  -1.771307 -16.723269 -3.426008
H  -1.41792 -14.073125 -7.567582
H  -0.054202 -16.106908 -7.292832
N  -7.68992 -5.711327 -9.35901
C  -7.362505 -4.608243 -10.008974
C  -7.888809 -4.329725 -11.258937
C  -8.779008 -5.240044 -11.820915
C  -9.111502 -6.39217 -11.108163
C  -8.540295 -6.587404 -9.866588
H  -7.597499 -3.417104 -11.756113
H  -9.800045 -7.131548 -11.487627
C  -6.387352 -3.670171 -9.289002
C  -8.847833 -7.806281 -8.998291
O  -6.011517 -4.083985 -8.163637
O  -6.091914 -2.624795 -9.873135
O  -8.238237 -7.814667 -7.899421
O  -9.639721 -8.635188 -9.459217
C  -9.372902 -5.025074 -13.101531
C  -9.920606 -4.900335 -14.165469
C  -10.618472 -4.799634 -15.399742
C  -10.51794 -3.659084 -16.202307
C  -11.215255 -3.569808 -17.392777
C  -12.026268 -4.612414 -17.812461
C  -12.13144 -5.750287 -17.026782
C  -11.436805 -5.846604 -15.836499
H  -9.887983 -2.845866 -15.871556
H  -12.572274 -4.539804 -18.744315
H  -11.126003 -2.676193 -17.997823
H  -11.518707 -6.732148 -15.221947
H  -12.761849 -6.571524 -17.343617
totalener: -2830.87821653 hartree
nucrepener: 6879.82230942 hartree
electener: -9710.70052595 hartree
twoeener: 7955.09808951 hartree
kineticenergy: 2783.23396543 hartree
xcener: -275.679752674380 hartree
chargesum: -3.0000000
charge: -0.143652 0.210404 -0.287904 0.060199 -0.209441 0.160439 0.115456 0.128803 0.269913 0.297810 -0.319237 -0.384032 -0.383925 -0.533503 -0.017496 -0.047167 0.062599 -0.181111 -0.126780 -0.104894 -0.134453 -0.172882 0.128433 0.099416 0.101885 0.146453 0.109915 1.533319 -0.111165 0.173451 0.144977 -0.296868 0.188589 -0.320547 0.131090 0.124141 0.312312 0.283554 -0.539380 -0.373893 -0.398946 -0.537308 -0.019930 -0.140113 0.066665 -0.150952 -0.138789 -0.092437 -0.132869 -0.168502 0.138450 0.109921 0.109111 0.133986 0.106513 -0.070819 0.077904 -0.266111 0.070653 -0.254187 0.090382 0.146329 0.147869 0.295986 0.297194 -0.581865 -0.353945 -0.587448 -0.341418 -0.187029 -0.236622 0.004341 -0.156052 -0.149462 -0.114654 -0.148754 -0.159043 0.118576 0.097431 0.080359 0.120218 0.080543
charge: 0.273225 -0.129925 -0.114266 -0.094663 -0.062800 -0.098524 0.143689 0.148781 -0.485349 -0.505194 0.118736 0.055919 0.051653 -0.074525 -0.007909 -0.045279 -0.116109 -0.098150 -0.155048 -0.171230 -0.151648 -0.091275 0.146904 0.138570 0.139516 0.153309 0.142203 0.630097 0.259244 -0.112555 -0.111122 -0.071025 -0.077525 -0.093906 0.139371 0.137208 -0.472405 -0.452408 -0.081588 0.046961 0.015908 -0.132162 0.002019 -0.070934 -0.051970 -0.097398 -0.160072 -0.187579 -0.162064 -0.095062 0.142037 0.144842 0.144665 0.139736 0.143484 0.212358 -0.080470 -0.099202 -0.042762 -0.097193 -0.086382 0.124089 0.123014 -0.440863 -0.467187 -0.147794 0.045200 -0.110513 0.063844 -0.179282 -0.207339 -0.036782 -0.126915 -0.186975 -0.240087 -0.186306 -0.126306 0.121961 0.143003 0.140181 0.122435 0.139866
qa: -0.1437 0.2104 -0.2879 0.0602 -0.2094 0.1604 0.1155 0.1288 0.2699 0.2978 -0.3192 -0.3840 -0.3839 -0.5335 -0.0175 -0.0472 0.0626 -0.1811 -0.1268 -0.1049 -0.1345 -0.1729 0.1284 0.0994 0.1019 0.1465 0.1099 1.5333 -0.1112 0.1735 0.1450 -0.2969 0.1886 -0.3205 0.1311 0.1241 0.3123 0.2836 -0.5394 -0.3739 -0.3989 -0.5373 -0.0199 -0.1401 0.0667 -0.1510 -0.1388 -0.0924 -0.1329 -0.1685 0.1384 0.1099 0.1091 0.1340 0.1065 -0.0708 0.0779 -0.2661 0.0707 -0.2542 0.0904 0.1463 0.1479 0.2960 0.2972 -0.5819 -0.3539 -0.5874 -0.3414 -0.1870 -0.2366 0.0043 -0.1561 -0.1495 -0.1147 -0.1488 -0.1590 0.1186 0.0974 0.0804 0.1202 0.0805
va: 2.9556 3.8234 3.8671 3.7216 3.8930 3.6760 0.9724 0.9840 4.2210 4.4501 2.1173 1.9932 2.1196 1.9131 3.9734 3.8825 3.8962 3.9347 3.8897 3.8799 3.9019 3.9288 0.9773 0.9717 0.9721 0.9745 0.9722 2.6889 2.8775 3.6812 3.6742 3.9415 3.6054 3.9213 0.9886 0.9862 4.3665 4.3927 1.8861 2.1126 2.0875 1.8437 3.7741 3.8307 3.8908 3.8803 3.8983 3.8968 3.8838 3.8920 0.9676 0.9723 0.9704 0.9685 0.9703 2.9318 3.6817 3.8271 3.5252 3.8325 3.7164 0.9668 0.9667 4.3290 4.3141 1.8095 2.1324 1.8147 2.1325 3.2570 3.3877 3.6510 3.8519 3.8617 3.9297 3.8642 3.8569 0.9622 0.9733 0.9706 0.9628 0.9702
dispersion: -0.095576786 hartree
dispersion: -0.096574925 hartree
dispersion: -0.097571718 hartree
dispersion: -0.098564239 hartree
dispersion: -0.099536681 hartree
dispersion: -0.100486245 hartree
dispersion: -0.101403384 hartree
dispersion: -0.102273630 hartree
dispersion: -0.103083593 hartree
dispersion: -0.103827840 hartree
dispersion: -0.104553751 hartree
dispersion: -0.105278864 hartree
dispersion: -0.105967736 hartree
dispersion: -0.106607818 hartree
dispersion: -0.107181967 hartree
dispersion: -0.107592651 hartree
dispersion: -0.107809178 hartree
dispersion: -0.107912422 hartree
dispersion: -0.108004443 hartree
dispersion: -0.108069209 hartree
dispersion: -0.108102206 hartree
dispersion: -0.108182405 hartree
dispersion: -0.108344558 hartree
dispersion: -0.108558798 hartree
dispersion: -0.108904292 hartree
dispersion: -0.109248922 hartree
dispersion: -0.109514259 hartree
dispersion: -0.109701902 hartree
dispersion: -0.109789422 hartree
dispersion: -0.109923876 hartree
dispersion: -0.110068322 hartree
dispersion: -0.110150146 hartree
dispersion: -0.110340996 hartree
dispersion: -0.110713149 hartree
dispersion: -0.110847129 hartree
dispersion: -0.110936568 hartree
dispersion: -0.111121557 hartree
dispersion: -0.111196316 hartree
dispersion: -0.111292019 hartree
dispersion: -0.111145960 hartree
dispersion: -0.111414701 hartree
dispersion: -0.111465780 hartree
dispersion: -0.111413853 hartree
dispersion: -0.111379864 hartree
dispersion: -0.111599494 hartree
dispersion: -0.111712122 hartree
dispersion: -0.111511982 hartree
dispersion: -0.111402459 hartree
dispersion: -0.111993681 hartree
dispersion: -0.111761716 hartree
dispersion: -0.111596520 hartree
dispersion: -0.111777075 hartree
dispersion: -0.112007974 hartree
dispersion: -0.111854671 hartree
dispersion: -0.111709500 hartree
dispersion: -0.112060863 hartree
dispersion: -0.112003344 hartree
dispersion: -0.111914995 hartree
dispersion: -0.111944371 hartree
dispersion: -0.112105143 hartree
dispersion: -0.112124882 hartree
dispersion: -0.111929524 hartree
dispersion: -0.112171163 hartree
dispersion: -0.112025046 hartree
dispersion: -0.112307464 hartree
dispersion: -0.112057371 hartree
dispersion: -0.112176480 hartree
dispersion: -0.112247181 hartree
dispersion: -0.112114205 hartree
dispersion: -0.112181548 hartree
dispersion: -0.112332575 hartree
dispersion: -0.112169304 hartree
dispersion: -0.112148823 hartree
dispersion: -0.112191944 hartree
dispersion: -0.112296953 hartree
dispersion: -0.112152144 hartree
dispersion: -0.112158651 hartree
dispersion: -0.112165986 hartree
dispersion: -0.112161973 hartree
dispersion: -0.112087233 hartree
dispersion: -0.112084065 hartree
dispersion: -0.111968885 hartree
dispersion: -0.111825549 hartree
dispersion: -0.111691610 hartree
dispersion: -0.111584032 hartree
dispersion: -0.111519046 hartree
dispersion: -0.111480639 hartree
dispersion: -0.111463123 hartree
dispersion: -0.111447804 hartree
dispersion: -0.111440792 hartree
dispersion: -0.111450302 hartree
dispersion: -0.111527670 hartree
dispersion: -0.111496005 hartree
dispersion: -0.111454586 hartree
dispersion: -0.111524426 hartree
dispersion: -0.111575771 hartree
dispersion: -0.111579954 hartree
dispersion: -0.111594756 hartree
dispersion: -0.111602554 hartree
dispersion: -0.111596632 hartree
dispersion: -0.111580670 hartree
dispersion: -0.111474961 hartree
dispersion: -0.111324539 hartree
dispersion: -0.111201366 hartree
dispersion: -0.111153862 hartree
dispersion: -0.111194831 hartree
dispersion: -0.111203025 hartree
dispersion: -0.111287121 hartree
dispersion: -0.111369612 hartree
dispersion: -0.111452138 hartree
dispersion: -0.111468654 hartree
dispersion: -0.111315387 hartree
dispersion: -0.111199422 hartree
dispersion: -0.111237223 hartree
dispersion: -0.111294755 hartree
dispersion: -0.111365608 hartree
dispersion: -0.111484427 hartree
dispersion: -0.111571979 hartree
dispersion: -0.111567672 hartree
dispersion: -0.111522133 hartree
dispersion: -0.111502795 hartree
dispersion: -0.111440827 hartree
dispersion: -0.111434042 hartree
dispersion: -0.111322779 hartree
dispersion: -0.111182671 hartree
dispersion: -0.111152557 hartree
dispersion: -0.111359704 hartree
dispersion: -0.111299382 hartree
dispersion: -0.111252088 hartree
dispersion: -0.111351473 hartree
dispersion: -0.111498766 hartree
dispersion: -0.111601508 hartree
dispersion: -0.111737202 hartree
dispersion: -0.111632385 hartree
dispersion: -0.111409470 hartree
dispersion: -0.111227477 hartree
dispersion: -0.111158281 hartree
dispersion: -0.111222141 hartree
dispersion: -0.111255100 hartree
dispersion: -0.111318653 hartree
dispersion: -0.111342171 hartree
dispersion: -0.111271411 hartree
energy: -2832.903787422652 hartree
