program: Orca
programVersion: 5.0.3
elementType: N C C C C C H H C C O O O O C C O C C C C C H H H H H Y N C C C C C H H C C O O O O C O C C C C C C H H H H H N C C C C C H H C O O C O O C O C C C C C C H H H H H
elementType: Y
charge: -3
multiplicity: 1
keywords: RKS B3LYP D3BJ DEF2-TZVP OPT
formula: C42H21N3O15Y
InChI: InChI=1/3C14H7NO5.Y/c3*16-12(8-4-2-1-3-5-8)9-6-10(13(17)18)15-11(7-9)14(19)20;/h3*1-7H;/q3*-3;+9/rC42H21N3O15Y/c46-34(22-10-4-1-5-11-22)25-16-28-37(49)55-61(43(28)29(17-25)38(50)56-61,44-30(39(51)57-61)18-26(19-31(44)40(52)58-61)35(47)23-12-6-2-7-13-23)45-32(41(53)59-61)20-27(21-33(45)42(54)60-61)36(48)24-14-8-3-9-15-24/h1-21H
82 atoms
N  -0.408539 2.974337 -1.571069
C  -0.631996 4.198218 -2.034946
C  -0.178094 5.322016 -1.350883
C  0.454748 5.133984 -0.125441
C  0.727972 3.838053 0.312151
C  0.286169 2.772146 -0.456071
H  -0.422363 6.304706 -1.728319
H  1.199453 3.633287 1.263238
C  -1.567241 4.278236 -3.244608
C  0.365218 1.321638 0.021889
O  -1.609891 5.34548 -3.868523
O  -2.223632 3.212577 -3.444169
O  -0.475061 0.560317 -0.541881
O  1.185979 1.050319 0.90787
C  0.657546 6.289386 0.796959
C  -0.094106 6.213033 2.09225
O  1.35358 7.253848 0.524414
C  -1.203926 5.375584 2.239309
C  0.300049 7.027423 3.158998
C  -1.905514 5.347296 3.440093
C  -0.390234 6.987204 4.359903
C  -1.495319 6.145143 4.500512
H  -2.032999 6.114007 5.442043
H  -2.75756 4.683145 3.507314
H  -1.5555 4.744441 1.433944
H  1.153587 7.679075 3.021123
H  -0.070744 7.607569 5.190445
Y  -2.110436 1.213684 -2.176512
N  -3.289711 0.162235 -0.14335
C  -3.565009 -1.136718 -0.151081
C  -3.660055 0.934458 0.876519
C  -4.244368 -1.73823 0.900605
C  -4.627281 -0.955998 1.992914
C  -4.33217 0.409658 1.972757
H  -4.468434 -2.79069 0.816769
H  -4.606657 1.061692 2.788078
C  -3.091895 -1.928394 -1.37012
C  -3.297432 2.41704 0.760844
O  -3.405778 -3.133924 -1.418056
O  -2.430464 -1.260948 -2.205023
O  -3.498216 3.128001 1.762901
O  -2.817334 2.75683 -0.352458
C  -5.366452 -1.527907 3.145677
O  -6.096397 -0.85409 3.855799
C  -5.217603 -2.994654 3.458615
C  -4.024139 -3.690395 3.262788
C  -3.927656 -5.030985 3.618829
C  -5.024613 -5.693062 4.156852
C  -6.218235 -5.004236 4.357162
C  -6.307508 -3.661599 4.021616
H  -2.995853 -5.559285 3.460471
H  -3.172195 -3.183419 2.832335
H  -7.078561 -5.516993 4.771737
H  -4.952379 -6.743205 4.415279
H  -7.220499 -3.104056 4.184154
N  -2.892846 0.295342 -4.396713
C  -4.174035 -0.048078 -4.481672
C  -4.581858 -1.078416 -5.315877
C  -3.62172 -1.729816 -6.089633
C  -2.304741 -1.280325 -6.065636
C  -1.971117 -0.274017 -5.164499
H  -5.614463 -1.396857 -5.280758
H  -1.52113 -1.757616 -6.636746
C  -5.108733 0.609468 -3.463317
O  -6.327329 0.494189 -3.64731
O  -4.499965 1.176457 -2.508471
C  -0.524345 0.116988 -4.85213
O  -0.389742 0.684574 -3.727841
O  0.343279 -0.175249 -5.684145
C  -3.955563 -3.016187 -6.769374
O  -3.853643 -3.188345 -7.972813
C  -4.391272 -4.124434 -5.858084
C  -4.141891 -4.075999 -4.483341
C  -4.530039 -5.129946 -3.662924
C  -5.174161 -6.231801 -4.210914
C  -5.421265 -6.29073 -5.584107
C  -5.024249 -5.246441 -6.403491
H  -3.637118 -3.236653 -4.024185
H  -5.4882 -7.049672 -3.571377
H  -4.318756 -5.044301 -2.604754
H  -5.195476 -5.271565 -7.472278
H  -5.925713 -7.152018 -6.008915
totalener: -2943.85478299 hartree
nucrepener: 8509.85328628 hartree
twoeener: 9649.59881297 hartree
kineticenergy: 2908.11972673 hartree
exchangeener: -298.224262657886 hartree
correlationener: -17.605955301541 hartree
xcener: -315.830217959427 hartree
dispersion: -0.235901736 hartree
dispersion: -0.235611866 hartree
dispersion: -0.234876915 hartree
dispersion: -0.233874166 hartree
dispersion: -0.232644662 hartree
dispersion: -0.231728576 hartree
dispersion: -0.231078587 hartree
dispersion: -0.230967568 hartree
dispersion: -0.230862070 hartree
dispersion: -0.231187169 hartree
dispersion: -0.231534687 hartree
dispersion: -0.231927771 hartree
dispersion: -0.232375595 hartree
dispersion: -0.232854680 hartree
dispersion: -0.233367738 hartree
dispersion: -0.233946636 hartree
dispersion: -0.234507541 hartree
dispersion: -0.236743303 hartree
dispersion: -0.237905371 hartree
dispersion: -0.237768936 hartree
dispersion: -0.237715850 hartree
dispersion: -0.237580275 hartree
dispersion: -0.237463996 hartree
dispersion: -0.237345741 hartree
dispersion: -0.237198330 hartree
dispersion: -0.237094757 hartree
dispersion: -0.237004961 hartree
dispersion: -0.236910274 hartree
dispersion: -0.236774497 hartree
dispersion: -0.236639316 hartree
dispersion: -0.236444133 hartree
dispersion: -0.236301291 hartree
dispersion: -0.236161359 hartree
dispersion: -0.236088807 hartree
dispersion: -0.235989756 hartree
dispersion: -0.235866215 hartree
dispersion: -0.235715205 hartree
dispersion: -0.235622362 hartree
dispersion: -0.235596667 hartree
dispersion: -0.235580459 hartree
dispersion: -0.235762376 hartree
dispersion: -0.235847150 hartree
dispersion: -0.236367237 hartree
dispersion: -0.236441865 hartree
dispersion: -0.236248834 hartree
dispersion: -0.236083732 hartree
dispersion: -0.236027745 hartree
dispersion: -0.235924805 hartree
dispersion: -0.235917453 hartree
dispersion: -0.236007094 hartree
dispersion: -0.235754502 hartree
dispersion: -0.236005009 hartree
dispersion: -0.235986459 hartree
dispersion: -0.235996294 hartree
dispersion: -0.235944886 hartree
dispersion: -0.235982833 hartree
dispersion: -0.236041642 hartree
dispersion: -0.236038560 hartree
dispersion: -0.236074448 hartree
dispersion: -0.236215105 hartree
dispersion: -0.236447360 hartree
dispersion: -0.236777341 hartree
dispersion: -0.236619635 hartree
dispersion: -0.236762924 hartree
dispersion: -0.236687834 hartree
dispersion: -0.236755131 hartree
dispersion: -0.236819669 hartree
dispersion: -0.236908521 hartree
dispersion: -0.236854476 hartree
dispersion: -0.236912414 hartree
dispersion: -0.236986544 hartree
dispersion: -0.237025190 hartree
dispersion: -0.237028008 hartree
dispersion: -0.237015320 hartree
dispersion: -0.237017930 hartree
dispersion: -0.237016853 hartree
dispersion: -0.237013998 hartree
dispersion: -0.237011966 hartree
dispersion: -0.237016918 hartree
dispersion: -0.237021071 hartree
dispersion: -0.237025004 hartree
dispersion: -0.237031018 hartree
dispersion: -0.237033698 hartree
dispersion: -0.237037573 hartree
dispersion: -0.237041382 hartree
dispersion: -0.237042399 hartree
dispersion: -0.237045022 hartree
dispersion: -0.237045573 hartree
dispersion: -0.237045945 hartree
dispersion: -0.237045621 hartree
dispersion: -0.237045607 hartree
dispersion: -0.237043266 hartree
dispersion: -0.237044114 hartree
dispersion: -0.237043872 hartree
dispersion: -0.237062758 hartree
dispersion: -0.237084040 hartree
dispersion: -0.237119867 hartree
dispersion: -0.237125152 hartree
dispersion: -0.237116175 hartree
dispersion: -0.237653310 hartree
dispersion: -0.238367874 hartree
dispersion: -0.242125859 hartree
dispersion: -0.243811723 hartree
dispersion: -0.241887234 hartree
dispersion: -0.240598263 hartree
dispersion: -0.240660534 hartree
dispersion: -0.240337317 hartree
dispersion: -0.240310218 hartree
dispersion: -0.240449900 hartree
dispersion: -0.240528527 hartree
dispersion: -0.240451096 hartree
dispersion: -0.240497888 hartree
dispersion: -0.240668687 hartree
dispersion: -0.240693179 hartree
dispersion: -0.240877899 hartree
dispersion: -0.240895665 hartree
dispersion: -0.240739181 hartree
dispersion: -0.240984229 hartree
dispersion: -0.240913633 hartree
dispersion: -0.240883135 hartree
dispersion: -0.240896291 hartree
dispersion: -0.240909821 hartree
dispersion: -0.240893855 hartree
chargesum: -3.0000000
charge: -0.175419 0.155918 -0.296235 0.305875 -0.300366 0.137417 0.094853 0.097012 0.311022 0.317354 -0.463330 -0.469925 -0.469917 -0.468825 0.176851 0.057255 -0.339173 -0.206422 -0.176679 -0.174782 -0.087869 -0.082388 0.069775 0.154559 0.283502 0.087352 0.056884 1.248161 -0.168525 0.193996 0.216847 -0.361931 0.286122 -0.305911 0.134594 0.107803 0.339055 0.331325 -0.517019 -0.496390 -0.508710 -0.501361 0.166834 -0.330669 0.135548 -0.225735 -0.096477 -0.100272 -0.095635 -0.163888 0.099275 0.179370 0.072525 0.074585 0.105055 -0.178757 0.138498 -0.301140 0.304847 -0.291848 0.150933 0.095529 0.094062 0.316903 -0.466899 -0.471940 0.309014 -0.470012 -0.464073 0.182323 -0.338903 0.050568 -0.202991 -0.174180 -0.083561 -0.087015 -0.176395 0.282254 0.069434 0.154154 0.088906 0.057413
charge: 0.281138 -0.137416 -0.060900 -0.107954 -0.069995 -0.145716 0.151821 0.152457 -0.555990 -0.563685 -0.023792 0.083950 0.080798 -0.026246 -0.235861 -0.112861 0.100753 -0.053048 -0.106373 -0.120472 -0.170736 -0.151297 0.130174 0.154511 0.175309 0.141649 0.126493 0.172294 0.298127 -0.137636 -0.130504 -0.063772 -0.118098 -0.042910 0.155459 0.154775 -0.562499 -0.560762 -0.037926 0.086855 -0.031603 0.084099 -0.239716 0.113002 -0.099153 -0.080593 -0.141048 -0.153260 -0.157860 -0.092061 0.140175 0.163022 0.131883 0.131749 0.148427 0.280507 -0.145177 -0.071046 -0.108446 -0.062661 -0.137777 0.152264 0.151692 -0.564220 -0.024981 0.079736 -0.557561 0.083935 -0.024639 -0.235627 0.101461 -0.112769 -0.052395 -0.120897 -0.151142 -0.170469 -0.105630 0.175689 0.130089 0.154352 0.141922 0.126615
qa: -0.1754 0.1559 -0.2962 0.3059 -0.3004 0.1374 0.0949 0.0970 0.3110 0.3174 -0.4633 -0.4699 -0.4699 -0.4688 0.1769 0.0573 -0.3392 -0.2064 -0.1767 -0.1748 -0.0879 -0.0824 0.0698 0.1546 0.2835 0.0874 0.0569 1.2482 -0.1685 0.1940 0.2168 -0.3619 0.2861 -0.3059 0.1346 0.1078 0.3391 0.3313 -0.5170 -0.4964 -0.5087 -0.5014 0.1668 -0.3307 0.1355 -0.2257 -0.0965 -0.1003 -0.0956 -0.1639 0.0993 0.1794 0.0725 0.0746 0.1051 -0.1788 0.1385 -0.3011 0.3048 -0.2918 0.1509 0.0955 0.0941 0.3169 -0.4669 -0.4719 0.3090 -0.4700 -0.4641 0.1823 -0.3389 0.0506 -0.2030 -0.1742 -0.0836 -0.0870 -0.1764 0.2823 0.0694 0.1542 0.0889 0.0574
va: 3.0769 3.6169 4.0285 3.2212 3.9630 3.6582 1.0261 1.0255 4.4514 4.4265 2.0404 1.9618 1.9426 2.0370 4.0465 3.5077 2.1259 3.9382 3.9499 3.9612 3.8195 3.8162 0.9684 1.0048 0.9085 1.0072 0.9688 3.0582 3.0621 3.6225 3.5684 3.9580 3.1528 4.0217 1.0144 1.0404 4.3611 4.3687 1.9651 1.9298 1.9716 1.9257 4.0598 2.1415 3.6363 3.9898 3.8860 3.8937 3.8542 3.9814 0.9703 0.9568 0.9705 0.9688 1.0033 3.0755 3.6598 3.9615 3.2257 4.0233 3.6225 1.0268 1.0261 4.4287 2.0390 1.9413 4.4548 1.9621 2.0400 4.0404 2.1262 3.5131 3.9369 3.9627 3.8152 3.8187 3.9482 0.9071 0.9684 1.0066 1.0083 0.9688
dispersion: -0.240888204 hartree
energy: -2944.343157881062 hartree
dipole: -48.21797 45.74583 -2.47215 -69.82181 65.40771 -4.41410 91.39209 -86.28633 5.10576
magnitude: 7.18781 au
magnitude: 18.26995 debye
