program: Orca
programVersion: 5.0.3
elementType: C C C C H H C C C C C C C C C C C C C C C C C C H H C C C C C C C C C C C C C C C C C C H H C C C C C C C C C C C C C C Y H H H H H H H H H H H H H H H H H H H H H H H H H H H H H H H H H N N N O O O O O O O O O P P P
elementType: Y
charge: 0
multiplicity: 1
keywords: RKS B3LYP D3BJ DEF2-TZVP OPT
formula: C54H39N3O9P3Y
InChI: InChI=1/3C18H13NO3P.Y/c3*20-18(21)16-12-7-13-17(19-16)23(22,14-8-3-1-4-9-14)15-10-5-2-6-11-15;/h3*1-13H;/q3*-3;+9/rC54H39N3O9P3Y/c58-52-46-34-19-37-49-55(46)70(61-52,64-67(49,40-22-7-1-8-23-40)41-24-9-2-10-25-41,56-47(53(59)62-70)35-20-38-50(56)68(65-70,42-26-11-3-12-27-42)43-28-13-4-14-29-43)57-48(54(60)63-70)36-21-39-51(57)69(66-70,44-30-15-5-16-31-44)45-32-17-6-18-33-45/h1-39H
109 atoms
C  3.077826 0.538626 -1.022638
C  3.337954 -0.339966 0.203148
C  4.609331 -0.78503 0.558862
C  4.762152 -1.517811 1.726193
H  5.735432 -1.892683 2.01678
H  3.731762 -2.324984 3.44973
C  3.64992 -1.764372 2.528195
C  2.423528 -1.276207 2.102937
C  0.796891 -3.070601 3.696981
C  0.530511 -4.128286 2.81902
C  0.511528 -5.430057 3.298201
C  0.758746 -5.685307 4.643982
C  1.032866 -4.637179 5.515452
C  1.054934 -3.329916 5.0441
C  0.872354 -0.208412 4.332938
C  -0.220063 -0.165458 5.204842
C  -0.342202 0.86713 6.122056
C  0.624075 1.866596 6.177287
C  1.716431 1.823778 5.321165
C  1.841066 0.791138 4.400797
C  -0.339783 -3.126149 -0.631631
C  -1.820599 -2.76141 -0.549701
C  -2.84584 -3.672992 -0.792592
C  -4.161096 -3.258691 -0.645365
H  -4.977858 -3.94028 -0.846237
H  -5.436866 -1.614728 -0.057949
C  -4.423701 -1.960445 -0.214375
C  -3.341572 -1.125417 0.018029
C  -4.252179 0.453243 2.290221
C  -3.460146 0.170482 3.407402
C  -4.048815 0.063149 4.659327
C  -5.423172 0.229765 4.802372
C  -6.212833 0.503887 3.6906
C  -5.629614 0.615851 2.434211
C  -4.32567 1.635777 -0.378839
C  -4.496059 1.321777 -1.726472
C  -5.055026 2.256494 -2.589578
C  -5.449083 3.497717 -2.109419
C  -5.276837 3.81818 -0.76415
C  -4.712155 2.894349 0.099336
C  -1.504968 1.399923 -2.683738
C  -1.201136 2.684884 -1.913431
C  -1.704644 3.921161 -2.309912
C  -1.506712 5.020661 -1.489704
H  -1.909668 5.988514 -1.759991
H  -0.656551 5.695153 0.37703
C  -0.798313 4.864927 -0.30186
C  -0.299848 3.605128 -0.00193
C  2.294049 3.882124 1.323857
C  3.379908 3.008776 1.377784
C  4.669852 3.487345 1.194277
C  4.881225 4.841386 0.968863
C  3.801246 5.718536 0.916552
C  2.509444 5.24143 1.084522
C  -0.182598 3.849437 2.915197
C  -1.407504 3.261388 3.250966
C  -2.090183 3.680358 4.382065
C  -1.560629 4.689195 5.182401
C  -0.341746 5.270956 4.854829
C  0.351275 4.850611 3.724478
Y  -0.006471 0.05918 -0.090918
H  5.437478 -0.542632 -0.091811
H  0.352656 -3.947534 1.766488
H  0.306592 -6.242071 2.613026
H  0.740963 -6.703037 5.013118
H  1.227862 -4.835748 6.561562
H  1.266754 -2.515141 5.7235
H  -0.980176 -0.934967 5.152951
H  -1.196181 0.90277 6.786189
H  0.517985 2.683653 6.878248
H  2.464156 2.605161 5.354078
H  2.677001 0.782339 3.716723
H  -2.584328 -4.680123 -1.084001
H  -2.393186 0.04134 3.277575
H  -3.43608 -0.150217 5.525717
H  -5.879452 0.146556 5.780614
H  -7.281198 0.635953 3.802932
H  -6.242591 0.844041 1.571862
H  -4.147482 0.376751 -2.118363
H  -5.142802 2.019218 -3.640387
H  -5.877358 4.226516 -2.785846
H  -5.572254 4.791706 -0.394421
H  -4.557192 3.15139 1.139712
H  -2.25746 3.976573 -3.236095
H  3.198668 1.955935 1.530611
H  5.50269 2.797189 1.202355
H  5.88582 5.214183 0.816182
H  3.966335 6.771269 0.727167
H  1.675074 5.926974 1.013516
H  -1.795794 2.463856 2.631708
H  -3.029546 3.210182 4.643993
H  -2.093966 5.015755 6.066422
H  0.075914 6.047429 5.482996
H  1.311583 5.28793 3.487547
N  2.278357 -0.606403 0.960578
N  -2.082535 -1.515491 -0.170819
N  -0.505338 2.549621 -0.787999
O  1.843644 0.791463 -1.223411
O  4.055241 0.942135 -1.640975
O  -0.281657 -1.147533 2.045919
O  0.446973 -2.127371 -0.672275
O  -0.053941 -4.321612 -0.594215
O  -1.986709 1.013532 0.931417
O  -1.172342 0.333077 -2.069528
O  -2.088254 1.504594 -3.757924
O  0.723846 1.660033 1.564808
P  0.847224 -1.418102 2.992837
P  -3.395472 0.553521 0.707096
P  0.657189 3.151214 1.478802
totalener: -3984.66949005 hartree
kineticenergy: 3942.61658968 hartree
exchangeener: -366.409710050486 hartree
correlationener: -21.037652041605 hartree
xcener: -387.447362092091 hartree
dispersion: -0.376635165 hartree
dispersion: -0.380186942 hartree
dispersion: -0.383014933 hartree
dispersion: -0.383128771 hartree
dispersion: -0.383421603 hartree
dispersion: -0.385119153 hartree
dispersion: -0.383989189 hartree
dispersion: -0.384432504 hartree
dispersion: -0.384729052 hartree
dispersion: -0.385101002 hartree
dispersion: -0.385002914 hartree
dispersion: -0.385072008 hartree
dispersion: -0.385057880 hartree
dispersion: -0.385107349 hartree
dispersion: -0.385108658 hartree
dispersion: -0.385116105 hartree
dispersion: -0.385071792 hartree
dispersion: -0.385062466 hartree
chargesum: -0.0000000
charge: 0.369749 0.064736 -0.190020 -0.022355 0.123503 0.136664 -0.184305 0.030424 -0.080464 -0.207281 -0.175997 -0.065740 -0.130483 -0.137134 0.105246 -0.297350 -0.100840 -0.058989 -0.154596 -0.134503 0.297625 0.165096 -0.192243 -0.018373 0.123216 0.119417 -0.209689 0.061738 -0.032847 -0.207740 -0.167863 -0.082661 -0.119531 -0.174084 -0.001971 -0.130638 -0.128988 -0.092076 -0.109308 -0.210361 0.348618 0.076161 -0.141970 -0.059769 0.116850 0.130907 -0.192831 0.091057 0.040565 -0.121195 -0.140841 -0.075483 -0.104402 -0.236090 -0.095237 -0.146776 -0.186895 -0.083044 -0.147310 -0.106657 1.266930 0.144946 0.271898 0.128113 0.115552 0.111561 0.140352 0.149691 0.104988 0.109379 0.112573 0.146452 0.139682 0.260750 0.109855 0.116858 0.116965 0.142560 0.191796 0.128482 0.115994 0.109547 0.132737 0.134885 0.191193 0.112800 0.116300 0.113039 0.109026 0.253420 0.133963 0.111734 0.113233 0.156812 -0.180023 -0.179194 -0.174085 -0.497563 -0.394849 -0.646196 -0.487809 -0.415778 -0.694230 -0.502777 -0.397035 -0.676716 0.874126 0.884434 0.828990
charge: -0.554990 -0.144730 -0.072555 -0.104761 0.147673 0.150923 -0.119978 -0.277257 -0.230689 -0.089663 -0.117817 -0.121050 -0.138233 -0.131933 -0.218002 -0.125246 -0.135405 -0.117293 -0.127701 -0.111089 -0.560923 -0.132203 -0.067250 -0.103521 0.147643 0.147687 -0.122524 -0.275697 -0.223481 -0.106033 -0.135150 -0.123323 -0.131968 -0.122631 -0.233893 -0.098419 -0.111936 -0.120830 -0.135767 -0.122677 -0.557826 -0.137180 -0.067651 -0.106406 0.146370 0.144651 -0.128419 -0.269779 -0.222062 -0.098031 -0.113716 -0.114547 -0.131266 -0.129498 -0.220395 -0.101237 -0.130455 -0.127068 -0.137838 -0.125288 0.058237 0.160532 0.167400 0.151344 0.144467 0.143314 0.149241 0.149662 0.141762 0.144559 0.145686 0.150913 0.159744 0.161630 0.142339 0.144879 0.145348 0.150721 0.163400 0.153278 0.145105 0.143643 0.149069 0.159643 0.156856 0.148369 0.145866 0.144634 0.143243 0.160467 0.146376 0.143630 0.144051 0.150885 0.252364 0.258034 0.257699 0.082777 0.045888 -0.141319 0.085631 0.029877 -0.134210 0.081052 0.043085 -0.123682 0.715500 0.714235 0.723106
qa: 0.3697 0.0647 -0.1900 -0.0224 0.1235 0.1367 -0.1843 0.0304 -0.0805 -0.2073 -0.1760 -0.0657 -0.1305 -0.1371 0.1052 -0.2974 -0.1008 -0.0590 -0.1546 -0.1345 0.2976 0.1651 -0.1922 -0.0184 0.1232 0.1194 -0.2097 0.0617 -0.0328 -0.2077 -0.1679 -0.0827 -0.1195 -0.1741 -0.0020 -0.1306 -0.1290 -0.0921 -0.1093 -0.2104 0.3486 0.0762 -0.1420 -0.0598 0.1169 0.1309 -0.1928 0.0911 0.0406 -0.1212 -0.1408 -0.0755 -0.1044 -0.2361 -0.0952 -0.1468 -0.1869 -0.0830 -0.1473 -0.1067 1.2669 0.1449 0.2719 0.1281 0.1156 0.1116 0.1404 0.1497 0.1050 0.1094 0.1126 0.1465 0.1397 0.2607 0.1099 0.1169 0.1170 0.1426 0.1918 0.1285 0.1160 0.1095 0.1327 0.1349 0.1912 0.1128 0.1163 0.1130 0.1090 0.2534 0.1340 0.1117 0.1132 0.1568 -0.1800 -0.1792 -0.1741 -0.4976 -0.3948 -0.6462 -0.4878 -0.4158 -0.6942 -0.5028 -0.3970 -0.6767 0.8741 0.8844 0.8290
va: 4.3566 3.7174 3.9644 3.7977 0.9688 0.9677 3.9337 3.9559 3.8241 3.9259 3.9588 3.8435 3.9087 3.8275 3.7118 3.9232 3.8560 3.8756 3.9423 3.8893 4.4037 3.6826 3.9900 3.8098 0.9688 0.9770 3.9841 3.9842 3.9194 3.8957 3.9159 3.8963 3.9071 3.8891 3.8065 3.9041 3.9599 3.8600 3.8600 3.9215 4.3954 3.7854 3.9430 3.8573 0.9723 0.9676 3.9382 4.0333 3.7418 3.9140 3.9733 3.8898 3.9104 3.8845 3.9129 3.8742 3.8864 3.8447 3.8859 3.7674 2.9707 1.0026 0.8974 0.9774 0.9676 0.9712 0.9638 0.9607 0.9751 0.9762 0.9762 0.9487 1.0007 0.9118 0.9810 0.9688 0.9707 0.9671 0.9528 0.9839 0.9686 0.9712 0.9669 1.0072 0.9135 0.9807 0.9684 0.9699 0.9808 0.9011 0.9636 0.9702 0.9715 0.9536 2.9226 2.9741 2.9454 1.9570 2.1036 1.9171 1.9667 2.0671 1.8487 1.9456 2.1033 1.8995 4.6483 4.6133 4.6365
dispersion: -0.385059973 hartree
energy: -3985.052870815256 hartree
dipole: -40.84427 38.16026 -2.68400 53.63970 -50.76808 2.87162 119.75441 -113.15746 6.59696
magnitude: 7.67919 au
magnitude: 19.51894 debye
