program: Orca
programVersion: 5.0.3
elementType: Y C C C C C C C C C C C C C C C C C C C C C C C C C C C C C C C C C C C C C C C C H H H H H H H H H H H H H H H H H H H H H H H H H H H H H H H H N N N N N N N N O O O O O O O O O O O O
elementType: Y
charge: -1
multiplicity: 1
keywords: RKS CAM-B3LYP D3BJ DEF2-TZVP OPT
formula: C40H32N8O12Y
InChI: InChI=1/2C20H16N4O6.Y/c2*25-17-9-3-7-15(23(17)29)19(27)21-11-13-5-1-2-6-14(13)12-22-20(28)16-8-4-10-18(26)24(16)30;/h2*1-10,21-22H,11-12H2;/q2*-4;+8/rC40H32N8O12Y/c49-37-29-13-5-17-33-45(29)57-61(53-33,54-34-18-6-14-30(46(34)58-61)38(50)42-22-26-10-2-1-9-25(26)21-41-37)55-35-19-7-15-31(47(35)59-61)39(51)43-23-27-11-3-4-12-28(27)24-44-40(52)32-16-8-20-36(56-61)48(32)60-61/h1-20,41-44H,21-24H2
93 atoms
Y  0.02648 -0.209887 0.055414
C  1.575353 1.386721 -2.2528
C  2.260462 2.377555 -2.985666
C  2.149122 2.442836 -4.347582
C  1.341282 1.53807 -5.03101
C  0.688232 0.554336 -4.332764
C  -0.280582 -0.327767 -5.082351
C  -2.18556 -1.837651 -4.952782
C  -3.354602 -1.980274 -4.013306
C  -3.617339 -3.221713 -3.447939
C  -4.640165 -3.392219 -2.533924
C  -5.429195 -2.31079 -2.182486
C  -5.185502 -1.075204 -2.750557
C  -4.15185 -0.891619 -3.660133
C  -3.87495 0.5139 -4.138821
C  -3.893208 2.233137 -2.404408
C  -3.229163 2.717082 -1.134797
C  -3.648016 3.907686 -0.598947
C  -3.06821 4.377812 0.577156
C  -2.096404 3.650746 1.20475
C  -1.661159 2.418802 0.672651
C  -1.703865 -2.616932 1.197172
C  -2.361658 -3.539763 2.036768
C  -2.645247 -4.803549 1.599242
C  -2.271864 -5.206188 0.319024
C  -1.645095 -4.313566 -0.511893
C  -1.116922 -4.818645 -1.831202
C  0.466525 -4.523133 -3.646007
C  1.75146 -3.77235 -3.875723
C  1.822093 -2.885222 -4.942402
C  2.95798 -2.135917 -5.181889
C  4.05498 -2.278639 -4.350314
C  3.999856 -3.166518 -3.293063
C  2.858398 -3.916286 -3.037927
C  2.853027 -4.799559 -1.810432
C  3.726264 -3.834235 0.264186
C  3.535809 -2.755057 1.312746
C  4.456742 -2.668668 2.324734
C  4.342556 -1.65543 3.27475
C  3.332378 -0.737828 3.194499
C  2.378991 -0.800556 2.1544
H  -0.923519 -1.111958 -3.348461
H  -2.487094 0.839233 -2.544207
H  -0.103421 -3.103882 -2.110544
H  1.990355 -3.292504 -0.544508
H  2.852055 3.079791 -2.417175
H  2.672987 3.215718 -4.894871
H  1.181196 1.582263 -6.09579
H  -2.995691 -4.067276 -3.711859
H  -4.805169 -4.363589 -2.088072
H  -6.226278 -2.42592 -1.459771
H  -5.788734 -0.22026 -2.469483
H  -4.429859 4.437514 -1.118002
H  -3.389366 5.323164 0.99517
H  -1.621099 3.977823 2.1176
H  -2.607289 -3.199692 3.031895
H  -3.142415 -5.502811 2.258743
H  -2.429283 -6.205802 -0.051425
H  0.962277 -2.76472 -5.588219
H  2.974228 -1.434116 -6.004577
H  4.949586 -1.694097 -4.519744
H  4.851163 -3.275645 -2.631976
H  5.254182 -3.393552 2.332523
H  5.066384 -1.590508 4.076903
H  3.222667 0.067384 3.905572
H  -2.46416 -1.345863 -5.883803
H  -1.823238 -2.832381 -5.225041
H  -4.802108 1.023187 -4.392763
H  -3.23335 0.522182 -5.017665
H  -0.180166 -4.399719 -4.51855
H  0.632193 -5.595272 -3.541632
H  2.039168 -5.521791 -1.844141
H  3.788725 -5.349416 -1.734741
N  0.863732 0.460531 -2.993657
N  -1.125718 -1.061672 -4.348499
N  -3.248562 1.268947 -3.073255
N  -2.257738 2.00882 -0.505894
N  -1.433494 -3.046134 -0.089286
N  -0.203844 -4.06063 -2.451209
N  2.729968 -3.993845 -0.614771
N  2.525766 -1.850624 1.261363
O  1.552197 1.268291 -1.006727
O  0.335085 -0.528984 -2.293232
O  -0.305647 -0.283831 -6.304159
O  -4.943937 2.747084 -2.756307
O  -1.806631 0.850411 -0.976643
O  -0.785847 1.67404 1.161216
O  -1.347295 -1.4594 1.502811
O  -0.923333 -2.126037 -0.893045
O  -1.47005 -5.916037 -2.238227
O  4.759575 -4.48679 0.273176
O  1.590351 -1.900905 0.322978
O  1.429506 -0.010977 1.966264
totalener: -2922.23743148 hartree
nucrepener: 9973.35510892 hartree
kineticenergy: 2892.15903887 hartree
xcener: -288.183685918717 hartree
dispersion: -0.142718581 hartree
dispersion: -0.142315578 hartree
dispersion: -0.141992849 hartree
dispersion: -0.141779508 hartree
dispersion: -0.141831413 hartree
dispersion: -0.142741441 hartree
dispersion: -0.144133133 hartree
dispersion: -0.145051003 hartree
dispersion: -0.145783475 hartree
dispersion: -0.145522286 hartree
dispersion: -0.146297183 hartree
dispersion: -0.146251400 hartree
dispersion: -0.146389411 hartree
dispersion: -0.146361410 hartree
dispersion: -0.146515544 hartree
dispersion: -0.146621512 hartree
dispersion: -0.146797997 hartree
dispersion: -0.146926633 hartree
dispersion: -0.147107393 hartree
dispersion: -0.147285329 hartree
dispersion: -0.147326613 hartree
dispersion: -0.147646407 hartree
dispersion: -0.147573075 hartree
dispersion: -0.147649794 hartree
dispersion: -0.147488137 hartree
dispersion: -0.147477493 hartree
dispersion: -0.147439478 hartree
dispersion: -0.147566116 hartree
dispersion: -0.147569788 hartree
dispersion: -0.147576674 hartree
dispersion: -0.147537543 hartree
dispersion: -0.147516439 hartree
dispersion: -0.147501772 hartree
dispersion: -0.147496186 hartree
dispersion: -0.147485901 hartree
dispersion: -0.147452358 hartree
dispersion: -0.147319203 hartree
dispersion: -0.147089015 hartree
dispersion: -0.147000570 hartree
dispersion: -0.147099293 hartree
dispersion: -0.147001484 hartree
dispersion: -0.146955867 hartree
dispersion: -0.146965138 hartree
dispersion: -0.146995553 hartree
dispersion: -0.146979371 hartree
dispersion: -0.146890613 hartree
dispersion: -0.146909531 hartree
dispersion: -0.146908688 hartree
dispersion: -0.147028752 hartree
dispersion: -0.147142847 hartree
dispersion: -0.147402173 hartree
dispersion: -0.147291141 hartree
dispersion: -0.147797579 hartree
dispersion: -0.147811140 hartree
dispersion: -0.147769795 hartree
dispersion: -0.147503090 hartree
dispersion: -0.147276800 hartree
dispersion: -0.147230212 hartree
dispersion: -0.147014466 hartree
dispersion: -0.146848257 hartree
dispersion: -0.146641843 hartree
dispersion: -0.146521649 hartree
dispersion: -0.146479188 hartree
dispersion: -0.146513087 hartree
dispersion: -0.146627132 hartree
dispersion: -0.146716495 hartree
dispersion: -0.146888488 hartree
dispersion: -0.147032436 hartree
dispersion: -0.147327709 hartree
dispersion: -0.147243824 hartree
dispersion: -0.147187662 hartree
dispersion: -0.147184845 hartree
dispersion: -0.147268620 hartree
dispersion: -0.147183867 hartree
dispersion: -0.147017927 hartree
dispersion: -0.146754774 hartree
dispersion: -0.146582067 hartree
dispersion: -0.146284399 hartree
dispersion: -0.146480941 hartree
dispersion: -0.146809046 hartree
dispersion: -0.147117997 hartree
dispersion: -0.147190617 hartree
dispersion: -0.147297291 hartree
dispersion: -0.147275574 hartree
dispersion: -0.147064955 hartree
dispersion: -0.146861021 hartree
dispersion: -0.146686100 hartree
dispersion: -0.146732747 hartree
dispersion: -0.146734345 hartree
dispersion: -0.146905348 hartree
dispersion: -0.146978982 hartree
dispersion: -0.147046203 hartree
dispersion: -0.147089718 hartree
dispersion: -0.147008374 hartree
dispersion: -0.146908417 hartree
dispersion: -0.146941638 hartree
dispersion: -0.147066369 hartree
dispersion: -0.147125366 hartree
dispersion: -0.147153988 hartree
dispersion: -0.147227785 hartree
dispersion: -0.146858851 hartree
dispersion: -0.147434262 hartree
dispersion: -0.147267581 hartree
dispersion: -0.147370272 hartree
dispersion: -0.147335475 hartree
dispersion: -0.147346285 hartree
chargesum: -1.0000000
charge: 1.408984 0.354892 -0.235898 -0.051458 -0.217695 0.072981 0.198230 -0.219756 0.118707 -0.186126 -0.167235 -0.118653 -0.136127 -0.009914 -0.141989 0.217234 0.050136 -0.209933 -0.058334 -0.235829 0.346654 0.364511 -0.238499 -0.050331 -0.222412 0.085283 0.189523 -0.207087 0.120409 -0.187499 -0.166364 -0.122377 -0.138825 0.000987 -0.148867 0.231747 0.033447 -0.208683 -0.056818 -0.237681 0.346236 0.325247 0.301630 0.320208 0.306345 0.125509 0.115109 0.145921 0.154332 0.121560 0.107848 0.138120 0.145745 0.114903 0.128798 0.125954 0.114840 0.145962 0.151832 0.123818 0.108085 0.137065 0.146764 0.114055 0.126436 0.168271 0.111159 0.154604 0.142385 0.113474 0.160126 0.139189 0.155348 0.260674 -0.283829 -0.254852 0.236667 0.253114 -0.280929 -0.257616 0.240865 -0.515526 -0.629798 -0.392698 -0.395053 -0.630425 -0.475239 -0.502013 -0.621212 -0.392073 -0.399164 -0.637904 -0.479204
charge: 0.140277 -0.369641 -0.124218 -0.140786 -0.136103 -0.131259 -0.434923 -0.230074 -0.121476 -0.108432 -0.139779 -0.143247 -0.102502 -0.114744 -0.221350 -0.428003 -0.125599 -0.136608 -0.141034 -0.122570 -0.367497 -0.368934 -0.122927 -0.140616 -0.137018 -0.131631 -0.432848 -0.229752 -0.121542 -0.109049 -0.139399 -0.143605 -0.103057 -0.113869 -0.221820 -0.425833 -0.125539 -0.137963 -0.141525 -0.123725 -0.367208 0.191411 0.186073 0.192710 0.184756 0.151293 0.144506 0.157816 0.152758 0.145529 0.141348 0.153707 0.157848 0.144434 0.152164 0.151524 0.144463 0.157567 0.152457 0.146321 0.141491 0.153725 0.157817 0.144257 0.151265 0.146180 0.133800 0.149522 0.140154 0.134576 0.144623 0.139953 0.149914 0.211344 0.156615 0.154723 0.212894 0.214169 0.154587 0.155886 0.212226 0.099199 -0.119504 0.047151 0.043962 -0.117979 0.120852 0.111588 -0.110389 0.049386 0.040017 -0.109668 0.114408
qa: 1.4090 0.3549 -0.2359 -0.0515 -0.2177 0.0730 0.1982 -0.2198 0.1187 -0.1861 -0.1672 -0.1187 -0.1361 -0.0099 -0.1420 0.2172 0.0501 -0.2099 -0.0583 -0.2358 0.3467 0.3645 -0.2385 -0.0503 -0.2224 0.0853 0.1895 -0.2071 0.1204 -0.1875 -0.1664 -0.1224 -0.1388 0.0010 -0.1489 0.2317 0.0334 -0.2087 -0.0568 -0.2377 0.3462 0.3252 0.3016 0.3202 0.3063 0.1255 0.1151 0.1459 0.1543 0.1216 0.1078 0.1381 0.1457 0.1149 0.1288 0.1260 0.1148 0.1460 0.1518 0.1238 0.1081 0.1371 0.1468 0.1141 0.1264 0.1683 0.1112 0.1546 0.1424 0.1135 0.1601 0.1392 0.1553 0.2607 -0.2838 -0.2549 0.2367 0.2531 -0.2809 -0.2576 0.2409 -0.5155 -0.6298 -0.3927 -0.3951 -0.6304 -0.4752 -0.5020 -0.6212 -0.3921 -0.3992 -0.6379 -0.4792
va: 2.7904 4.0547 3.9105 3.8036 3.9235 3.7446 4.1851 3.7701 3.5487 3.8991 3.9284 3.8794 3.8623 3.7231 3.7665 4.2939 3.7979 3.9145 3.8042 3.9064 4.0863 4.0437 3.9073 3.8026 3.9225 3.7628 4.1885 3.7658 3.5406 3.9027 3.9212 3.8712 3.8634 3.7085 3.7588 4.3045 3.8007 3.9174 3.8021 3.9053 4.0935 0.9082 0.9439 0.9123 0.9401 0.9854 0.9712 1.0081 0.9821 0.9787 0.9733 0.9856 1.0056 0.9717 0.9833 0.9854 0.9711 1.0072 0.9770 0.9814 0.9737 0.9843 1.0071 0.9716 0.9838 0.9816 0.9804 0.9968 0.9720 0.9820 0.9782 0.9716 0.9956 3.5074 3.1096 3.1481 3.5115 3.5162 3.1087 3.1524 3.5062 1.9872 1.4704 2.1093 2.1185 1.4935 2.0400 2.0036 1.4960 2.1074 2.1177 1.5003 2.0296
dispersion: -0.147349150 hartree
energy: -2922.855613455627 hartree
dipole: -19.59360 19.75340 0.15980 -68.92347 69.25463 0.33116 -109.76911 110.09571 0.32660
magnitude: 0.49180 au
magnitude: 1.25006 debye
