program: Orca
programVersion: 5.0.3
elementType: Y S S S F F O O F F F O O F O O F F F O O C H C C H C C C C H H C H C H C H H C C C H C C C H H C C C H H C C H H C H C H C C H C H H C H H C H H C H C H C H C H
elementType: Y
charge: 0
multiplicity: 1
keywords: RKS CAM-B3LYP D3BJ DEF2-TZVP OPT
formula: C32H28F9O8S3Y
InChI: InChI=1/3C8H4F3O2S.2C4H8O.Y/c3*9-8(10,11)7(13)4-5(12)6-2-1-3-14-6;2*1-2-4-5-3-1;/h3*1-4H;2*1-4H2;/q3*-2;;;+6/rC32H28F9O8S3Y/c33-30(34,35)27-18-21(24-8-5-15-50-24)42-53(45-27,48-11-1-2-12-48,49-13-3-4-14-49,43-22(25-9-6-16-51-25)19-28(46-53)31(36,37)38)44-23(26-10-7-17-52-26)20-29(47-53)32(39,40)41/h5-10,15-20H,1-4,11-14H2
81 atoms
Y  6.321033 2.387228 10.963989
S  1.854243 3.640733 12.84996
S  6.287548 2.778997 5.977701
S  4.87954 7.033219 9.799388
F  8.858239 4.767183 14.518856
F  1.334429 1.62752 8.363188
O  5.276265 4.209037 10.025596
O  4.406967 1.516086 10.025934
F  8.693043 2.766163 15.312605
F  11.087482 0.88494 10.899238
F  1.841747 0.460544 10.104348
O  4.622918 3.008535 12.469539
O  6.785155 2.066888 8.692142
F  10.903197 -0.630649 9.37356
O  7.274253 3.101634 12.962841
O  8.238453 1.106961 10.812904
F  9.959015 -0.914263 11.289405
F  2.862599 0.111535 8.23586
F  7.572328 4.377383 16.206165
O  5.891004 0.349061 12.228452
O  8.044292 4.012916 10.419961
C  5.576046 3.84613 14.440592
H  5.398816 4.291897 15.403007
C  6.867218 3.575988 14.052353
C  8.814328 0.89487 8.519078
H  9.556005 0.493242 7.851618
C  8.973865 0.714885 9.873348
C  7.710614 1.605936 7.991907
C  4.489939 3.569659 13.577535
C  8.08198 4.911646 9.308902
H  7.908694 5.926746 9.676623
H  7.280658 4.640844 8.631432
C  2.659597 4.546359 15.100099
H  3.290478 4.830343 15.928502
C  8.468866 1.523136 5.532379
H  9.37229 0.949343 5.67156
C  9.480783 4.746983 8.735594
H  9.831181 5.663802 8.265162
H  9.484779 3.962663 7.980983
C  3.128793 3.945965 13.963833
C  7.625202 1.864085 6.553293
C  3.237168 3.396839 9.156969
H  2.316665 3.674052 8.675421
C  4.153229 4.410387 9.503285
C  8.001452 3.879475 15.040057
C  6.859455 -0.216788 13.143534
H  7.43789 0.606355 13.558262
H  7.530343 -0.859854 12.579764
C  2.355736 1.0632 9.022475
C  3.796621 5.811558 9.258622
C  9.316632 4.126664 11.075006
H  9.470252 3.226183 11.658027
H  9.277061 4.980007 11.754778
C  3.445689 2.06235 9.439297
C  6.048884 -0.959794 14.200961
H  5.998524 -2.023491 13.966272
H  6.485816 -0.856186 15.191952
C  0.705384 4.310923 13.908591
H  -0.334255 4.351392 13.627179
C  2.693477 6.361396 8.665874
H  1.883914 5.777736 8.255546
C  10.241384 -0.004761 10.354242
C  1.264813 4.755835 15.069807
H  0.702922 5.215796 15.868596
C  4.565655 -0.077665 12.596526
H  4.322802 -0.985773 12.039647
H  3.871193 0.704801 12.315246
C  4.662504 -0.332698 14.083113
H  3.865369 -0.977298 14.44896
H  4.617006 0.614036 14.623854
C  10.332481 4.334173 9.951347
H  11.058022 5.098093 10.224904
H  10.880458 3.416383 9.750888
C  6.863645 2.70272 4.380218
H  6.314521 3.173778 3.581343
C  8.03022 2.004104 4.280575
H  8.553609 1.8407 3.350787
C  2.727137 7.772157 8.647922
H  1.950807 8.391967 8.225355
C  3.855728 8.265859 9.230858
H  4.129298 9.301035 9.354122
totalener: -3969.94819249 hartree
nucrepener: 9356.94283373 hartree
kineticenergy: 3931.05619236 hartree
xcener: -317.042061588319 hartree
dispersion: -0.116606274 hartree
dispersion: -0.116536509 hartree
dispersion: -0.116567103 hartree
dispersion: -0.116621052 hartree
dispersion: -0.116710884 hartree
dispersion: -0.116766055 hartree
dispersion: -0.116804398 hartree
dispersion: -0.116858166 hartree
dispersion: -0.116878243 hartree
dispersion: -0.116933090 hartree
dispersion: -0.116973271 hartree
dispersion: -0.116949603 hartree
dispersion: -0.116937663 hartree
dispersion: -0.116946173 hartree
dispersion: -0.116999645 hartree
dispersion: -0.117068540 hartree
dispersion: -0.117155670 hartree
dispersion: -0.117240943 hartree
dispersion: -0.117287140 hartree
dispersion: -0.117387372 hartree
dispersion: -0.117496153 hartree
dispersion: -0.117583073 hartree
dispersion: -0.117618546 hartree
dispersion: -0.117593616 hartree
dispersion: -0.117528690 hartree
dispersion: -0.117520772 hartree
dispersion: -0.117534811 hartree
chargesum: -0.0000000
charge: 1.496502 0.096862 0.096055 0.086468 -0.169550 -0.178551 -0.522169 -0.479148 -0.169514 -0.173130 -0.174334 -0.506745 -0.489468 -0.174129 -0.518769 -0.510385 -0.165572 -0.164095 -0.174790 -0.383580 -0.371938 -0.424706 0.127805 0.268735 -0.435268 0.124252 0.273386 0.398288 0.381811 -0.076393 0.108294 0.142293 -0.203361 0.142311 -0.195244 0.142488 -0.191694 0.106727 0.119894 0.105477 0.071523 -0.447190 0.118173 0.464658 0.502254 -0.071123 0.136007 0.124235 0.500004 0.079517 -0.112958 0.162536 0.114304 0.306203 -0.202295 0.115131 0.117818 -0.183033 0.155058 -0.208302 0.142879 0.508545 -0.137217 0.135230 -0.073272 0.116166 0.150649 -0.183353 0.113780 0.116427 -0.158369 0.110044 0.107136 -0.175031 0.155258 -0.141060 0.135771 -0.138180 0.135043 -0.182321 0.154243
charge: 0.133615 0.801573 0.797670 0.791126 0.203691 0.196987 0.147451 0.153811 0.204160 0.198771 0.199889 0.153339 0.157252 0.201807 0.135475 0.140450 0.211129 0.211742 0.201024 0.206784 0.223530 -0.164742 0.152524 -0.311152 -0.163677 0.153549 -0.308994 -0.306752 -0.306553 -0.286578 0.125006 0.138809 -0.145790 0.147781 -0.146699 0.148074 -0.245886 0.134528 0.138335 -0.337659 -0.339752 -0.163957 0.153798 -0.297544 -0.641350 -0.259244 0.138564 0.130985 -0.641401 -0.332940 -0.275048 0.141940 0.127633 -0.304758 -0.251077 0.137987 0.138493 -0.388473 0.130690 -0.146083 0.147968 -0.641126 -0.203809 0.143098 -0.273704 0.130905 0.139681 -0.251547 0.137842 0.141930 -0.244332 0.134740 0.135164 -0.388474 0.130554 -0.203627 0.143216 -0.204197 0.143016 -0.391254 0.130090
qa: 1.4965 0.0969 0.0961 0.0865 -0.1696 -0.1786 -0.5222 -0.4791 -0.1695 -0.1731 -0.1743 -0.5067 -0.4895 -0.1741 -0.5188 -0.5104 -0.1656 -0.1641 -0.1748 -0.3836 -0.3719 -0.4247 0.1278 0.2687 -0.4353 0.1243 0.2734 0.3983 0.3818 -0.0764 0.1083 0.1423 -0.2034 0.1423 -0.1952 0.1425 -0.1917 0.1067 0.1199 0.1055 0.0715 -0.4472 0.1182 0.4647 0.5023 -0.0711 0.1360 0.1242 0.5000 0.0795 -0.1130 0.1625 0.1143 0.3062 -0.2023 0.1151 0.1178 -0.1830 0.1551 -0.2083 0.1429 0.5085 -0.1372 0.1352 -0.0733 0.1162 0.1506 -0.1834 0.1138 0.1164 -0.1584 0.1100 0.1071 -0.1750 0.1553 -0.1411 0.1358 -0.1382 0.1350 -0.1823 0.1542
va: 2.5816 2.8356 2.8338 2.8298 1.1276 1.1210 1.9341 2.0133 1.1289 1.1182 1.1213 1.9032 1.9390 1.1290 1.9562 1.9712 1.1394 1.1400 1.1274 1.9159 1.8932 3.9103 1.0057 3.8773 3.8904 1.0098 3.8671 3.6491 3.6681 3.7869 0.9702 0.9909 3.9373 0.9816 3.9377 0.9822 3.8822 0.9750 0.9698 3.7676 3.7629 3.8571 1.0126 3.6106 4.4984 3.7803 0.9785 0.9780 4.4853 3.7714 3.7953 0.9848 0.9763 3.8630 3.8515 0.9654 0.9730 3.9984 0.9730 3.9520 0.9821 4.4838 3.9595 0.9753 3.7728 0.9642 0.9805 3.8341 0.9754 0.9717 3.8284 0.9720 0.9878 3.9827 0.9727 3.9628 0.9755 3.9592 0.9755 3.9828 0.9732
dispersion: -0.117540977 hartree
energy: -3970.067638741594 hartree
dipole: -24.17654 23.28228 -0.89426 42.27259 -40.66520 1.60739 -18.51401 17.88342 -0.63059
magnitude: 1.94450 au
magnitude: 4.94252 debye
