program: Orca
programVersion: 5.0.3
elementType: C H C H H C C C C C C C C C C H C C H H C Y F F F F F F O O O O O O C C C H O O C C C H C C C C H C H C F F F C H H C C H H C C H H C H H H H H H
elementType: Y
charge: 0
multiplicity: 1
keywords: RKS CAM-B3LYP D3BJ DEF2-TZVP OPT
formula: C33H22F9O8Y
InChI: InChI=1/3C11H6F3O2.2H2O.Y/c3*12-11(13,14)10(16)8-5-6-3-1-2-4-7(6)9(8)15;;;/h3*1-4H,5H2;2*1H2;/q3*-2;;;+6/rC33H22F9O8Y/c34-31(35,36)28-22-13-16-7-1-4-10-19(16)25(22)45-51(43,44,48-28,46-26-20-11-5-2-8-17(20)14-23(26)29(49-51)32(37,38)39)47-27-21-12-6-3-9-18(21)15-24(27)30(50-51)33(40,41)42/h1-12H,13-15,43-44H2
73 atoms
C  20.8483 2.861458 -0.696997
H  21.924913 2.879371 -0.803592
C  19.583852 10.174208 1.090422
H  19.778152 11.167443 0.680058
H  19.000156 10.312965 2.002002
C  20.232729 3.627928 0.280259
C  20.058229 6.037114 3.016504
C  19.791687 5.128168 2.028698
C  21.931005 9.693516 2.117147
C  20.845879 9.380805 1.336492
C  20.8488 4.544744 1.243414
C  20.822485 8.187685 0.560637
C  18.948556 6.652666 3.87357
C  20.046782 2.097241 -1.521623
C  18.055112 2.885576 -0.388423
H  16.977731 2.888827 -0.283245
C  21.994246 11.081086 2.776666
C  18.461483 4.578106 1.557364
H  17.792677 5.360843 1.194212
H  17.923751 4.038842 2.337785
C  18.854787 3.651593 0.441486
Y  23.173244 6.625029 2.148113
F  19.274544 6.603081 5.169229
F  17.759332 6.057708 3.740919
F  18.782848 7.944897 3.551918
F  22.099274 12.046041 1.846293
F  20.892219 11.342107 3.494024
F  23.039821 11.192595 3.587639
O  22.070487 4.747791 1.312147
O  21.201762 6.500388 3.323113
O  22.932013 8.953812 2.331389
O  21.676307 7.278189 0.513169
O  24.700171 5.776835 0.617798
O  23.519679 7.010438 4.578474
C  18.840062 9.313229 0.104817
C  19.573525 8.175214 -0.206182
C  18.661636 2.112116 -1.36481
H  20.490032 1.48656 -2.296347
O  24.128392 4.777965 3.21659
O  25.316616 7.791294 2.297503
C  25.02253 4.573304 0.424119
C  17.595407 9.501085 -0.468727
C  19.100078 7.207454 -1.078007
H  18.048941 1.508636 -2.021778
C  24.46274 3.710689 2.652283
C  25.564964 4.269452 -0.983351
C  24.922256 3.530887 1.318584
C  17.114538 8.539423 -1.343143
H  17.002639 10.377598 -0.240893
C  17.856962 7.399861 -1.647163
H  19.694522 6.329633 -1.293455
C  24.415204 2.39459 3.29594
F  24.768005 3.393239 -1.621134
F  25.640106 5.360497 -1.731969
F  26.791221 3.723566 -0.933541
C  25.213812 2.065817 1.078561
H  16.142334 8.674018 -1.798993
H  17.455108 6.66518 -2.331697
C  24.836246 1.431441 2.387717
C  23.976422 2.059316 4.567319
H  26.261655 1.876422 0.837742
H  24.620913 1.649728 0.262039
C  24.833729 0.09698 2.751233
C  23.973204 0.725663 4.925642
H  23.636009 2.827528 5.248481
H  25.152466 -0.670497 2.057754
C  24.401316 -0.24475 4.022365
H  23.631739 0.427637 5.907683
H  24.388291 -1.285469 4.318642
H  25.84562 7.671641 1.501258
H  23.889815 6.151006 4.824417
H  25.105569 8.728555 2.40532
H  22.597146 7.007789 4.872207
totalener: -2809.47371559 hartree
nucrepener: 7607.62529292 hartree
twoeener: 8624.31832788 hartree
kineticenergy: 2771.02970655 hartree
xcener: -260.128368255724 hartree
dispersion: -0.098156374 hartree
dispersion: -0.098164573 hartree
dispersion: -0.098214004 hartree
dispersion: -0.097962935 hartree
dispersion: -0.097536208 hartree
dispersion: -0.097046837 hartree
dispersion: -0.096564981 hartree
dispersion: -0.096110290 hartree
dispersion: -0.095691179 hartree
dispersion: -0.095308858 hartree
dispersion: -0.094962829 hartree
dispersion: -0.094652922 hartree
dispersion: -0.094382260 hartree
dispersion: -0.094155563 hartree
dispersion: -0.093975065 hartree
dispersion: -0.093839375 hartree
dispersion: -0.093741512 hartree
dispersion: -0.093674576 hartree
dispersion: -0.093635191 hartree
dispersion: -0.093621222 hartree
dispersion: -0.093627380 hartree
dispersion: -0.093649079 hartree
dispersion: -0.093690231 hartree
dispersion: -0.093759863 hartree
dispersion: -0.093860790 hartree
dispersion: -0.093992371 hartree
dispersion: -0.094170046 hartree
dispersion: -0.094374308 hartree
dispersion: -0.094583087 hartree
dispersion: -0.094810227 hartree
dispersion: -0.095057334 hartree
dispersion: -0.095321560 hartree
dispersion: -0.095637026 hartree
dispersion: -0.095946088 hartree
dispersion: -0.096328530 hartree
dispersion: -0.096612857 hartree
dispersion: -0.097030525 hartree
dispersion: -0.097414624 hartree
dispersion: -0.097888726 hartree
dispersion: -0.098558568 hartree
dispersion: -0.099367201 hartree
dispersion: -0.100348268 hartree
dispersion: -0.101532911 hartree
dispersion: -0.102728715 hartree
dispersion: -0.103139677 hartree
dispersion: -0.102887949 hartree
dispersion: -0.102585672 hartree
dispersion: -0.101871163 hartree
dispersion: -0.101957873 hartree
dispersion: -0.101314763 hartree
dispersion: -0.101227051 hartree
dispersion: -0.101081710 hartree
dispersion: -0.100969710 hartree
dispersion: -0.101102046 hartree
dispersion: -0.101486683 hartree
dispersion: -0.101686074 hartree
dispersion: -0.101881679 hartree
dispersion: -0.101887466 hartree
dispersion: -0.101723815 hartree
dispersion: -0.101401017 hartree
dispersion: -0.101219630 hartree
dispersion: -0.101337318 hartree
dispersion: -0.101421030 hartree
dispersion: -0.101616316 hartree
dispersion: -0.101766629 hartree
dispersion: -0.101905854 hartree
dispersion: -0.102012050 hartree
dispersion: -0.102084988 hartree
dispersion: -0.102116688 hartree
dispersion: -0.102142697 hartree
dispersion: -0.102143350 hartree
dispersion: -0.102149944 hartree
dispersion: -0.102129258 hartree
dispersion: -0.102116693 hartree
dispersion: -0.102104790 hartree
chargesum: 0.0000000
charge: -0.188082 0.164572 -0.110924 0.129201 0.135110 0.023296 0.284120 -0.290677 0.295340 -0.267909 0.443656 0.369367 0.488889 -0.118964 -0.222993 0.125359 0.492163 -0.115978 0.141204 0.132151 0.026141 1.404427 -0.168743 -0.170715 -0.167711 -0.175265 -0.170348 -0.157031 -0.508618 -0.576334 -0.545619 -0.508513 -0.519676 -0.609835 -0.010512 0.116430 -0.094247 0.128038 -0.570021 -0.623523 0.263592 -0.204545 -0.268222 0.129155 0.408356 0.508800 -0.230344 -0.096716 0.125656 -0.110768 0.175924 0.090162 -0.177802 -0.151553 -0.174495 -0.140361 0.127931 0.129566 0.000323 -0.209460 0.133306 0.129591 -0.209417 -0.111488 0.127858 0.126574 -0.096688 0.129126 0.129847 0.355844 0.357169 0.363504 0.362348
charge: -0.077197 0.155068 -0.153824 0.153141 0.154499 -0.078678 -0.276239 -0.117871 -0.270104 -0.128686 -0.211155 -0.217443 -0.639599 -0.136438 -0.109930 0.148202 -0.640929 -0.158374 0.154310 0.151918 -0.078249 0.203776 0.206197 0.214742 0.207219 0.194921 0.205508 0.222908 0.176254 0.092221 0.094632 0.154907 0.112681 -0.133362 -0.073690 -0.076822 -0.122485 0.146273 0.106604 -0.117706 -0.269088 -0.107866 -0.079097 0.146766 -0.208998 -0.638514 -0.128674 -0.123653 0.148344 -0.140205 0.158831 -0.073666 0.195719 0.229511 0.198050 -0.153559 0.146465 0.146192 -0.074008 -0.082429 0.154072 0.152589 -0.108139 -0.136724 0.151255 0.148424 -0.121825 0.146145 0.147073 0.184780 0.182104 0.187719 0.185209
qa: -0.1881 0.1646 -0.1109 0.1292 0.1351 0.0233 0.2841 -0.2907 0.2953 -0.2679 0.4437 0.3694 0.4889 -0.1190 -0.2230 0.1254 0.4922 -0.1160 0.1412 0.1322 0.0261 1.4044 -0.1687 -0.1707 -0.1677 -0.1753 -0.1703 -0.1570 -0.5086 -0.5763 -0.5456 -0.5085 -0.5197 -0.6098 -0.0105 0.1164 -0.0942 0.1280 -0.5700 -0.6235 0.2636 -0.2045 -0.2682 0.1292 0.4084 0.5088 -0.2303 -0.0967 0.1257 -0.1108 0.1759 0.0902 -0.1778 -0.1516 -0.1745 -0.1404 0.1279 0.1296 0.0003 -0.2095 0.1333 0.1296 -0.2094 -0.1115 0.1279 0.1266 -0.0967 0.1291 0.1298 0.3558 0.3572 0.3635 0.3623
va: 3.9539 0.9747 3.9182 0.9677 0.9723 3.6941 3.7936 3.7240 3.8400 3.6985 3.7751 3.8005 4.5340 3.9004 3.9281 0.9759 4.5233 3.8574 0.9636 0.9662 3.7424 2.7672 1.1397 1.1287 1.1188 1.1253 1.1286 1.1585 1.9847 1.9072 1.9375 1.9743 1.9745 1.9405 3.8693 3.6143 3.8727 0.9727 1.9263 1.9274 3.8644 3.9339 3.9315 0.9688 3.8174 4.4731 3.6721 3.8888 0.9756 3.8723 0.9578 3.7330 1.1128 1.1687 1.1282 3.9258 0.9690 0.9728 3.8452 3.9516 0.9675 0.9685 3.9355 3.8989 0.9856 0.9760 3.8976 0.9711 0.9690 0.8968 0.8999 0.8964 0.8952
dispersion: -0.102109801 hartree
energy: -2809.980553285682 hartree
dipole: -92.52680 91.88117 -0.64563 -76.41627 74.77906 -1.63721 -44.21349 43.87540 -0.33809
magnitude: 1.79209 au
magnitude: 4.55514 debye
