program: Orca
programVersion: 5.0.3
elementType: Y N N C H C H C C H C H C H C H C C H C H C C C H C C C H C H C H C H C H O O F F F C C C H C C C H C H C H C H C H O O F F F C C C H C C C H C H C H C H C H O O F F F O H C H H C H H H
elementType: Y
charge: 0
multiplicity: 1
keywords: RKS B3LYP D3BJ DEF2-TZVP OPT
formula: C42H32F9N2O7Y
InChI: InChI=1/3C10H6F3O2.C10H8N2.C2H6O.Y/c3*11-10(12,13)9(15)6-8(14)7-4-2-1-3-5-7;1-5-11-6-2-9(1)10-3-7-12-8-4-10;1-2-3;/h3*1-6H;1-8H;3H,2H2,1H3;/q3*-2;-1;;+7/rC42H32F9N2O7Y/c1-2-54-61(53-24-20-30(21-25-53)29-18-22-52-23-19-29,55-34(31-12-6-3-7-13-31)26-37(58-61)40(43,44)45,56-35(32-14-8-4-9-15-32)27-38(59-61)41(46,47)48)57-36(33-16-10-5-11-17-33)28-39(60-61)42(49,50)51/h3-28,54H,2H2,1H3
93 atoms
Y  0.486816 8.02052 5.172415
N  -0.050491 5.580329 5.774354
N  0.550254 -1.302414 7.346104
C  0.063103 4.653178 4.814201
H  0.088731 5.022524 3.799131
C  0.156641 3.3015 5.08757
H  0.242564 2.602191 4.267762
C  0.138024 2.859973 6.41075
C  0.000671 3.831739 7.403924
H  0.005466 3.563132 8.45138
C  -0.085045 5.16585 7.04596
H  -0.152335 5.936545 7.80104
C  1.22191 -0.743275 6.338656
H  1.878371 -1.398921 5.776555
C  1.120791 0.597743 5.996911
H  1.711572 0.992263 5.180704
C  0.278758 1.428765 6.737287
C  -0.419912 0.84629 7.794697
H  -1.103954 1.427241 8.398922
C  -0.253708 -0.508016 8.05282
H  -0.797724 -0.976597 8.866358
C  3.830499 5.555878 3.057139
C  3.04018 6.830177 3.427552
C  3.345904 8.006857 2.749805
H  4.101291 7.971212 1.985622
C  2.760829 9.239936 3.098286
C  3.166464 10.511934 2.43663
C  3.946193 10.562158 1.277977
H  4.28999 9.650065 0.810499
C  4.272537 11.78236 0.702779
H  4.872865 11.807785 -0.197515
C  3.83297 12.96871 1.280575
H  4.094914 13.919176 0.832801
C  3.057442 12.930021 2.434589
H  2.708082 13.84844 2.888154
C  2.722194 11.712276 3.003406
H  2.111301 11.667583 3.892691
O  2.214399 6.647834 4.354805
O  1.879177 9.343122 3.998718
F  3.000259 4.515821 2.86612
F  4.669326 5.224587 4.055615
F  4.569788 5.686834 1.93883
C  -0.640758 6.752335 0.894437
C  -0.571468 7.736403 2.081668
C  -0.696147 9.088211 1.820768
H  -0.757837 9.411557 0.795289
C  -0.854557 10.033291 2.871107
C  -0.989304 11.482052 2.550621
C  -0.42444 12.043252 1.405185
H  0.098222 11.415999 0.695802
C  -0.477198 13.415206 1.197247
H  -0.009861 13.842639 0.3197
C  -1.111493 14.238753 2.120623
H  -1.154873 15.307916 1.95482
C  -1.686983 13.685385 3.261014
H  -2.185732 14.321764 3.9815
C  -1.614815 12.318769 3.478972
H  -2.029394 11.876486 4.374056
O  -0.43328 7.164378 3.200568
O  -0.888281 9.711729 4.081825
F  -1.87468 6.208985 0.809095
F  0.227218 5.740014 1.050882
F  -0.377555 7.333675 -0.291358
C  3.117023 7.682194 9.006861
C  2.165605 8.401539 8.029367
C  1.970135 9.763051 8.189801
H  2.528365 10.273475 8.954672
C  1.062123 10.481886 7.383548
C  0.885713 11.94342 7.588156
C  1.190295 12.580523 8.794734
H  1.542859 12.005736 9.640072
C  1.010283 13.94971 8.929502
H  1.235759 14.431509 9.872292
C  0.54039 14.70019 7.856601
H  0.410018 15.769988 7.961274
C  0.236216 14.073769 6.651825
H  -0.126145 14.653556 5.813162
C  0.397879 12.702943 6.521138
H  0.156606 12.197831 5.596645
O  1.668301 7.640406 7.161332
O  0.377928 9.9432 6.467857
F  4.239151 7.293367 8.376754
F  3.488536 8.452065 10.048766
F  2.528117 6.584154 9.513008
O  -1.653501 8.092143 6.333835
H  -1.708857 9.039492 6.528251
C  -2.849525 7.656137 5.645705
H  -2.639742 6.630373 5.346423
H  -2.971456 8.254458 4.740947
C  -4.064108 7.742896 6.543078
H  -3.935781 7.138283 7.441714
H  -4.946586 7.384983 6.008182
H  -4.25559 8.775285 6.847276
totalener: -3192.23223531 hartree
nucrepener: 9773.06245952 hartree
kineticenergy: 3161.32589658 hartree
exchangeener: -316.155512255004 hartree
correlationener: -18.426030254044 hartree
xcener: -334.581542509047 hartree
chargesum: 0.0000000
charge: 1.475140 -0.316924 -0.207092 -0.027131 0.200649 -0.132781 0.135139 0.146354 -0.173825 0.138293 0.004851 0.153775 -0.035208 0.134608 -0.170180 0.131290 0.104890 -0.166535 0.121244 -0.043158 0.130938 0.508575 0.285733 -0.395593 0.123461 0.387225 0.111975 -0.207804 0.121161 -0.108608 0.119274 -0.112996 0.118372 -0.146038 0.142719 -0.229754 0.297519 -0.500635 -0.514269 -0.183429 -0.169992 -0.178767 0.516872 0.322904 -0.468106 0.137040 0.441107 0.100558 -0.156193 0.119766 -0.104705 0.122474 -0.123154 0.127368 -0.125864 0.123129 -0.219754 0.172168 -0.558404 -0.497655 -0.190166 -0.170963 -0.173886 0.508841 0.287615 -0.411998 0.128151 0.404087 0.101031 -0.197534 0.120696 -0.108636 0.120418 -0.097227 0.121715 -0.155017 0.116367 -0.188362 0.254247 -0.519552 -0.520952 -0.163154 -0.176255 -0.190352 -0.499078 0.338831 -0.062647 0.145905 0.138289 -0.323007 0.126259 0.122899 0.111415
charge: 0.252506 0.196508 0.145967 -0.112185 0.115900 -0.063583 0.119598 -0.062206 -0.075878 0.116817 -0.121179 0.114253 -0.162786 0.104130 -0.080266 0.115337 -0.062726 -0.083692 0.112378 -0.173596 0.103898 -0.725558 -0.281150 -0.143364 0.112313 -0.233962 -0.083140 -0.061948 0.112259 -0.102315 0.109321 -0.098768 0.107329 -0.091925 0.107043 -0.049344 0.119046 0.123844 0.137350 0.216631 0.238751 0.230006 -0.664114 -0.298522 -0.145199 0.116136 -0.247497 -0.083926 -0.058450 0.113214 -0.093770 0.110131 -0.098946 0.110499 -0.103625 0.108675 -0.056887 0.114968 0.125101 0.152319 0.197648 0.213279 0.223673 -0.699795 -0.286838 -0.142540 0.113688 -0.225044 -0.077975 -0.069177 0.114132 -0.101805 0.110771 -0.090690 0.108902 -0.104196 0.109594 -0.051702 0.118689 0.121556 0.130834 0.239813 0.227056 0.195767 0.065114 0.226120 -0.289635 0.118552 0.108790 -0.250186 0.099291 0.106276 0.098316
qa: 1.4751 -0.3169 -0.2071 -0.0271 0.2006 -0.1328 0.1351 0.1464 -0.1738 0.1383 0.0049 0.1538 -0.0352 0.1346 -0.1702 0.1313 0.1049 -0.1665 0.1212 -0.0432 0.1309 0.5086 0.2857 -0.3956 0.1235 0.3872 0.1120 -0.2078 0.1212 -0.1086 0.1193 -0.1130 0.1184 -0.1460 0.1427 -0.2298 0.2975 -0.5006 -0.5143 -0.1834 -0.1700 -0.1788 0.5169 0.3229 -0.4681 0.1370 0.4411 0.1006 -0.1562 0.1198 -0.1047 0.1225 -0.1232 0.1274 -0.1259 0.1231 -0.2198 0.1722 -0.5584 -0.4977 -0.1902 -0.1710 -0.1739 0.5088 0.2876 -0.4120 0.1282 0.4041 0.1010 -0.1975 0.1207 -0.1086 0.1204 -0.0972 0.1217 -0.1550 0.1164 -0.1884 0.2542 -0.5196 -0.5210 -0.1632 -0.1763 -0.1904 -0.4991 0.3388 -0.0626 0.1459 0.1383 -0.3230 0.1263 0.1229 0.1114
va: 2.6569 3.0330 3.1113 3.8983 0.9725 3.8762 0.9821 3.6388 3.8471 0.9779 3.8788 0.9874 4.0371 0.9778 3.8832 0.9769 3.7126 3.8673 0.9762 4.0554 0.9789 4.4948 3.8482 3.8223 1.0107 3.7508 3.8330 3.9296 0.9916 3.8887 0.9732 3.8956 0.9717 3.8870 0.9661 3.9807 0.8151 1.9843 1.9560 1.1036 1.1285 1.1173 4.4865 3.7814 3.9532 1.0055 3.6897 3.7125 3.9029 0.9910 3.8913 0.9757 3.8893 0.9684 3.8669 0.9791 3.9210 0.9734 1.9331 1.9255 1.1032 1.1279 1.1297 4.4999 3.8694 3.8876 1.0115 3.7667 3.8474 3.9039 0.9935 3.9031 0.9736 3.8886 0.9715 3.9178 0.9856 3.9775 0.8672 1.9925 1.9498 1.1346 1.1209 1.1014 1.9260 0.8974 3.7350 0.9646 0.9462 3.9030 0.9647 0.9744 0.9671
dispersion: -0.243778773 hartree
dispersion: -0.243329618 hartree
dispersion: -0.242929450 hartree
dispersion: -0.242598331 hartree
dispersion: -0.242425852 hartree
dispersion: -0.242402546 hartree
dispersion: -0.242149014 hartree
dispersion: -0.241779903 hartree
dispersion: -0.241272130 hartree
dispersion: -0.240596144 hartree
dispersion: -0.239720478 hartree
dispersion: -0.238931166 hartree
dispersion: -0.238238050 hartree
dispersion: -0.237821937 hartree
dispersion: -0.237727884 hartree
dispersion: -0.238235142 hartree
dispersion: -0.238204540 hartree
dispersion: -0.238218822 hartree
dispersion: -0.237911409 hartree
dispersion: -0.237693680 hartree
dispersion: -0.237476215 hartree
dispersion: -0.237385374 hartree
dispersion: -0.237424198 hartree
dispersion: -0.237603355 hartree
dispersion: -0.237870699 hartree
dispersion: -0.238120436 hartree
dispersion: -0.238193267 hartree
dispersion: -0.238414372 hartree
dispersion: -0.238691372 hartree
dispersion: -0.239328000 hartree
dispersion: -0.240180829 hartree
dispersion: -0.241243136 hartree
dispersion: -0.241145156 hartree
dispersion: -0.240839812 hartree
dispersion: -0.241582601 hartree
dispersion: -0.242709358 hartree
dispersion: -0.243273196 hartree
dispersion: -0.242664521 hartree
dispersion: -0.243191137 hartree
dispersion: -0.242723111 hartree
dispersion: -0.241689455 hartree
dispersion: -0.241511741 hartree
dispersion: -0.242302535 hartree
dispersion: -0.242672258 hartree
dispersion: -0.243077906 hartree
dispersion: -0.243167385 hartree
dispersion: -0.242990331 hartree
dispersion: -0.242268822 hartree
energy: -3192.921610519812 hartree
