program: Orca
programVersion: 5.0.3
elementType: Y N N C H C H C C H C H C H C H C C H C H C C C H C C C H C H C H C H C H O O F F F C C C H C C C H C H C H C H C H O O F F F C C C H C C C H C H C H C H C H O O F F F O H C H H C H H H
elementType: Y
charge: 0
multiplicity: 1
keywords: RKS PBE D3BJ DEF2-TZVP OPT
formula: C42H32F9N2O7Y
InChI: InChI=1/3C10H6F3O2.C10H8N2.C2H6O.Y/c3*11-10(12,13)9(15)6-8(14)7-4-2-1-3-5-7;1-5-11-6-2-9(1)10-3-7-12-8-4-10;1-2-3;/h3*1-6H;1-8H;3H,2H2,1H3;/q3*-2;-1;;+7/rC42H32F9N2O7Y/c1-2-54-61(53-24-20-30(21-25-53)29-18-22-52-23-19-29,55-34(31-12-6-3-7-13-31)26-37(58-61)40(43,44)45,56-35(32-14-8-4-9-15-32)27-38(59-61)41(46,47)48)57-36(33-16-10-5-11-17-33)28-39(60-61)42(49,50)51/h3-28,54H,2H2,1H3
93 atoms
Y  0.719448 8.006296 5.12574
N  0.126001 5.569341 5.636477
N  -0.245207 -1.323461 7.393679
C  0.34008 4.606252 4.720096
H  0.57731 4.951869 3.713971
C  0.268399 3.251336 5.021916
H  0.43589 2.518419 4.23265
C  -0.036277 2.843448 6.328488
C  -0.261251 3.85362 7.275923
H  -0.470296 3.606708 8.316914
C  -0.166316 5.185924 6.89339
H  -0.310737 5.988879 7.616794
C  0.633996 -0.871158 6.4874
H  1.296195 -1.620575 6.043888
C  0.739342 0.465576 6.104929
H  1.494207 0.768197 5.377822
C  -0.109304 1.414533 6.693466
C  -1.026929 0.946625 7.645313
H  -1.730094 1.62961 8.124526
C  -1.055901 -0.413085 7.952396
H  -1.772811 -0.793442 8.686245
C  4.305028 5.744767 3.249511
C  3.433301 6.983549 3.560543
C  3.663604 8.156414 2.838143
H  4.433271 8.136395 2.074295
C  2.966415 9.357787 3.109561
C  3.233568 10.599145 2.326722
C  4.096769 10.641421 1.21878
H  4.62874 9.745796 0.898605
C  4.27225 11.82442 0.503536
H  4.943046 11.841488 -0.356776
C  3.5906 12.983848 0.883735
H  3.730367 13.908563 0.321131
C  2.730032 12.953413 1.984478
H  2.188277 13.852149 2.28371
C  2.553057 11.771705 2.698021
H  1.878886 11.727913 3.553035
O  2.581875 6.775511 4.473729
O  2.081175 9.447027 4.024254
F  3.52106 4.688233 2.909991
F  5.024241 5.383716 4.339455
F  5.181333 5.938607 2.230523
C  0.032357 6.817167 0.704489
C  -0.107038 7.724734 1.946232
C  -0.480941 9.053914 1.765859
H  -0.612836 9.417348 0.751718
C  -0.802753 9.897336 2.863371
C  -1.196648 11.316861 2.620609
C  -0.877547 11.993238 1.432315
H  -0.341229 11.475995 0.636784
C  -1.192891 13.342446 1.280117
H  -0.923086 13.859647 0.358127
C  -1.840876 14.032635 2.307541
H  -2.090283 15.087968 2.184731
C  -2.164095 13.368169 3.49485
H  -2.669242 13.902533 4.301439
C  -1.836969 12.023822 3.65163
H  -2.060689 11.49543 4.57861
O  0.139958 7.123707 3.038142
O  -0.790802 9.501005 4.070433
F  -0.829789 5.769786 0.788689
F  1.285106 6.303785 0.6255
F  -0.218892 7.455457 -0.466037
C  3.1009 7.556194 9.102102
C  2.247941 8.32402 8.065958
C  2.09055 9.702259 8.221742
H  2.641644 10.195794 9.015809
C  1.214738 10.452014 7.399359
C  1.047917 11.919249 7.601524
C  1.425138 12.58466 8.779141
H  1.840634 12.024404 9.617336
C  1.244409 13.961788 8.899072
H  1.531475 14.467121 9.822459
C  0.696324 14.693838 7.842194
H  0.563089 15.772778 7.937664
C  0.319203 14.040292 6.665153
H  -0.104851 14.604945 5.832622
C  0.48769 12.663667 6.548927
H  0.19754 12.135172 5.640604
O  1.762703 7.576481 7.164792
O  0.532276 9.929532 6.457135
F  4.13387 6.924105 8.501524
F  3.618163 8.35285 10.073302
F  2.342383 6.610602 9.718687
O  -1.405762 8.038627 6.440414
H  -1.362733 9.000981 6.621173
C  -2.696633 7.715935 5.870721
H  -2.656384 6.635755 5.674003
H  -2.804656 8.235729 4.905383
C  -3.827891 8.062675 6.818705
H  -3.714623 7.53965 7.778364
H  -4.792767 7.774397 6.376778
H  -3.861837 9.145417 7.014376
totalener: -3190.26512598 hartree
nucrepener: 9773.06245952 hartree
kineticenergy: 3160.54605802 hartree
exchangeener: -396.618869666480 hartree
correlationener: -15.203677766023 hartree
xcener: -411.822547432503 hartree
dispersion: -0.145298651 hartree
dispersion: -0.144878310 hartree
dispersion: -0.144463257 hartree
dispersion: -0.144090619 hartree
dispersion: -0.143816127 hartree
dispersion: -0.143765594 hartree
dispersion: -0.143648726 hartree
dispersion: -0.143449418 hartree
dispersion: -0.143153434 hartree
dispersion: -0.142776133 hartree
dispersion: -0.142397390 hartree
dispersion: -0.142035526 hartree
dispersion: -0.141719524 hartree
dispersion: -0.141477490 hartree
dispersion: -0.141303614 hartree
dispersion: -0.141197572 hartree
dispersion: -0.141153604 hartree
dispersion: -0.141124833 hartree
dispersion: -0.141071967 hartree
dispersion: -0.141054188 hartree
dispersion: -0.141087764 hartree
dispersion: -0.141215371 hartree
dispersion: -0.141432149 hartree
dispersion: -0.141732187 hartree
dispersion: -0.142024353 hartree
dispersion: -0.142110002 hartree
dispersion: -0.142084607 hartree
dispersion: -0.142004482 hartree
dispersion: -0.142005657 hartree
dispersion: -0.141965687 hartree
dispersion: -0.142050881 hartree
dispersion: -0.142008821 hartree
dispersion: -0.142215822 hartree
dispersion: -0.142138757 hartree
dispersion: -0.142118291 hartree
dispersion: -0.142167744 hartree
dispersion: -0.142203366 hartree
dispersion: -0.142247110 hartree
dispersion: -0.142260397 hartree
chargesum: -0.0000000
charge: 1.102607 -0.228317 -0.143345 -0.010720 0.157627 -0.138773 0.126635 0.130281 -0.115552 0.126073 -0.027946 0.143995 -0.075172 0.116089 -0.127972 0.126307 0.079706 -0.128099 0.113514 -0.076231 0.113382 0.377299 0.297828 -0.447289 0.107764 0.462850 0.115284 -0.185963 0.096945 -0.099244 0.105548 -0.095097 0.104022 -0.094679 0.096166 -0.145356 0.150999 -0.397132 -0.460715 -0.140186 -0.128985 -0.140460 0.384258 0.287436 -0.434251 0.111406 0.482737 0.032415 -0.120994 0.111224 -0.128976 0.104760 -0.084939 0.106990 -0.106636 0.106639 -0.153983 0.129428 -0.459773 -0.454850 -0.138249 -0.132900 -0.138178 0.385383 0.248829 -0.377168 0.115646 0.372534 0.135806 -0.174411 0.103580 -0.104522 0.106103 -0.078288 0.105570 -0.151758 0.101722 -0.179732 0.224179 -0.416839 -0.485134 -0.123791 -0.140806 -0.140733 -0.411771 0.322432 -0.068967 0.121585 0.131374 -0.337540 0.126307 0.125133 0.118028
charge: 0.068598 0.194239 0.141063 -0.153364 0.160146 -0.089088 0.158326 -0.080373 -0.094609 0.156899 -0.164755 0.158149 -0.203159 0.141342 -0.102202 0.155309 -0.093072 -0.106788 0.152109 -0.205619 0.140467 -0.633651 -0.304551 -0.143007 0.154024 -0.251556 -0.101350 -0.090347 0.150392 -0.138427 0.146842 -0.131442 0.145494 -0.135402 0.146960 -0.077573 0.161194 0.178473 0.169064 0.199832 0.208027 0.197155 -0.635391 -0.308362 -0.145041 0.156143 -0.264423 -0.104167 -0.087600 0.154254 -0.137641 0.147716 -0.133115 0.146276 -0.140547 0.146553 -0.091292 0.154931 0.154736 0.150262 0.198129 0.207378 0.199893 -0.635613 -0.304199 -0.145694 0.155095 -0.258738 -0.102190 -0.092898 0.150721 -0.136803 0.147169 -0.128656 0.146130 -0.137717 0.146199 -0.082827 0.161571 0.167359 0.137691 0.215215 0.196054 0.196094 0.066069 0.198247 -0.344607 0.138322 0.134327 -0.321701 0.126251 0.132284 0.124386
qa: 1.1026 -0.2283 -0.1433 -0.0107 0.1576 -0.1388 0.1266 0.1303 -0.1156 0.1261 -0.0279 0.1440 -0.0752 0.1161 -0.1280 0.1263 0.0797 -0.1281 0.1135 -0.0762 0.1134 0.3773 0.2978 -0.4473 0.1078 0.4628 0.1153 -0.1860 0.0969 -0.0992 0.1055 -0.0951 0.1040 -0.0947 0.0962 -0.1454 0.1510 -0.3971 -0.4607 -0.1402 -0.1290 -0.1405 0.3843 0.2874 -0.4343 0.1114 0.4827 0.0324 -0.1210 0.1112 -0.1290 0.1048 -0.0849 0.1070 -0.1066 0.1066 -0.1540 0.1294 -0.4598 -0.4549 -0.1382 -0.1329 -0.1382 0.3854 0.2488 -0.3772 0.1156 0.3725 0.1358 -0.1744 0.1036 -0.1045 0.1061 -0.0783 0.1056 -0.1518 0.1017 -0.1797 0.2242 -0.4168 -0.4851 -0.1238 -0.1408 -0.1407 -0.4118 0.3224 -0.0690 0.1216 0.1314 -0.3375 0.1263 0.1251 0.1180
va: 3.2822 3.1252 3.1504 3.9745 0.9982 3.9075 0.9746 3.6972 3.8979 0.9738 3.9667 0.9764 4.1058 0.9718 3.8929 0.9729 3.7914 3.8862 0.9754 4.1104 0.9718 4.6003 3.8136 3.9613 1.0059 3.6007 3.7767 3.9481 0.9852 3.9228 0.9676 3.9125 0.9661 3.9186 0.9736 3.9910 0.9701 2.1308 2.0798 1.1768 1.1933 1.1794 4.6045 3.8127 3.9678 1.0059 3.6193 3.8512 3.9231 0.9830 3.9665 0.9707 3.9074 0.9655 3.9269 0.9705 3.9680 0.9841 2.0808 2.0303 1.1834 1.1863 1.1853 4.5997 3.8830 3.9212 1.0029 3.7476 3.7330 3.9399 0.9833 3.9475 0.9677 3.9014 0.9658 3.9560 0.9797 3.9597 0.9091 2.1305 2.0074 1.2002 1.1790 1.1750 2.0651 0.9256 3.8800 0.9544 0.9655 3.9191 0.9722 0.9739 0.9709
dispersion: -0.142273573 hartree
energy: -3190.916323190201 hartree
dipole: -24.69445 22.56323 -2.13122 42.36618 -39.88583 2.48035 -9.15750 9.35552 0.19801
magnitude: 3.27620 au
magnitude: 8.32743 debye
