program: Orca
programVersion: 5.0.3
elementType: Y N C C C C C C O O C N C N N H C N C C C C C O O H H H H H H H C C C H H H N C C C N N C C O N C C H O N C C H C C O H O
elementType: Y
charge: -1
multiplicity: 1
keywords: RKS B3LYP D3BJ DEF2-TZVP OPT
formula: C28H14N10O8Y
InChI: InChI=1/2C14H7N5O4.Y/c2*20-13(21)9-5-1-3-7(15-9)11-17-12(19-18-11)8-4-2-6-10(16-8)14(22)23;/h2*1-6,18H;/q2*-2;+4/rC28H14N10O8Y/c39-25-17-9-1-5-13(29-17)21-33-22(36-35-21)14-6-2-10-18(30-14)26(40)44-47(43-25)45-27(41)19-11-3-7-15(31-19)23-34-24(38-37-23)16-8-4-12-20(32-16)28(42)46-47/h1-12,35,37H
61 atoms
Y  1.491274 5.6082 0.036766
N  2.912363 4.687728 2.312653
C  2.366413 5.007159 3.473541
C  2.955832 4.652779 4.688154
C  4.063895 4.010751 2.280398
C  4.721922 3.614386 3.438398
C  4.147524 3.946005 4.662875
C  1.061167 5.794498 3.379651
O  0.516913 6.130781 4.429492
O  0.681579 6.020403 2.186132
C  4.510515 3.778846 0.91221
N  3.820885 4.245353 -0.097379
C  4.503957 3.868705 -1.19602
N  5.605578 3.176751 -0.932834
N  5.593561 3.129517 0.423753
H  6.32922 2.649314 0.911124
C  3.971408 4.271535 -2.495247
N  2.838316 4.972293 -2.388626
C  2.245705 5.437423 -3.478628
C  4.55834 3.991883 -3.723471
C  2.761994 5.207316 -4.752424
C  3.932142 4.471016 -4.868978
C  0.977895 6.249968 -3.234136
O  0.661915 6.360693 -2.003952
O  0.393685 6.720583 -4.207457
H  4.360751 4.272647 -5.843964
H  5.475942 3.421775 -3.768129
H  2.235949 5.611671 -5.60519
H  2.465363 4.942968 5.606154
H  4.634275 3.654298 5.585453
H  5.655497 3.067911 3.393895
H  1.388791 12.234917 0.665223
C  1.365668 11.157501 0.556805
C  0.144436 10.493114 0.476781
C  2.54368 10.429662 0.501621
H  -0.788825 11.03996 0.523211
H  3.519556 10.889123 0.564814
H  -2.801697 9.389509 0.391298
N  -2.327947 8.507183 0.311466
C  0.162365 9.110512 0.340944
C  2.463799 9.043209 0.361229
C  -1.002084 8.236401 0.26536
N  -3.051254 7.360391 0.242597
N  1.302531 8.416467 0.2827
C  -2.10112 6.437945 0.15557
C  3.693977 8.139199 0.296835
O  4.799969 8.669047 0.378986
N  -0.850658 6.940591 0.163657
C  -2.245575 4.985699 0.088952
C  -3.452541 4.296879 0.109824
H  -4.385958 4.840325 0.158116
O  3.420147 6.902986 0.165002
N  -1.066812 4.358536 0.032175
C  -3.41026 2.907101 0.075624
C  -1.024892 3.034478 0.008251
H  -4.331033 2.336496 0.092496
C  -2.183495 2.260491 0.028019
C  0.37526 2.429978 -0.021997
O  1.312208 3.294943 -0.027249
H  -2.087803 1.184344 0.009977
O  0.47917 1.205601 -0.031222
totalener: -2262.75368104 hartree
nucrepener: 6266.15459563 hartree
electener: -8528.90827668 hartree
twoeener: 7090.59621698 hartree
kineticenergy: 2228.42591239 hartree
exchangeener: -228.784942173162 hartree
correlationener: -13.526317916031 hartree
xcener: -242.311260089193 hartree
dispersion: -0.188357283 hartree
dispersion: -0.187579281 hartree
dispersion: -0.187175676 hartree
dispersion: -0.186669555 hartree
dispersion: -0.186042217 hartree
dispersion: -0.185404661 hartree
dispersion: -0.184957921 hartree
dispersion: -0.184716801 hartree
dispersion: -0.184595151 hartree
dispersion: -0.184503551 hartree
dispersion: -0.184378407 hartree
dispersion: -0.184211308 hartree
dispersion: -0.184019539 hartree
dispersion: -0.183828659 hartree
dispersion: -0.183642178 hartree
dispersion: -0.183457835 hartree
dispersion: -0.183256428 hartree
dispersion: -0.183041488 hartree
dispersion: -0.182794467 hartree
dispersion: -0.182586297 hartree
dispersion: -0.182444456 hartree
dispersion: -0.182357193 hartree
dispersion: -0.182195386 hartree
dispersion: -0.182139889 hartree
dispersion: -0.182108458 hartree
dispersion: -0.182114066 hartree
dispersion: -0.182124112 hartree
dispersion: -0.182126361 hartree
chargesum: -1.0000000
charge: 1.405998 -0.225243 0.081999 -0.188365 0.085839 -0.179028 -0.047366 0.288259 -0.421298 -0.497731 0.346214 -0.190921 0.281368 -0.207411 -0.091514 0.220888 0.111120 -0.243035 0.084952 -0.195629 -0.190713 -0.019660 0.283269 -0.505714 -0.419066 0.096315 0.107520 0.120036 0.123830 0.099205 0.082467 0.099321 -0.047231 -0.179397 -0.188819 0.082751 0.123839 0.221124 -0.091134 0.089243 0.085950 0.343527 -0.207675 -0.221797 0.276810 0.286484 -0.420067 -0.191544 0.114689 -0.194532 0.107643 -0.493712 -0.245926 -0.019700 0.084339 0.096827 -0.191382 0.286314 -0.503724 0.120120 -0.418926
charge: 0.285323 0.276936 -0.145994 -0.086744 -0.164193 -0.110160 -0.118935 -0.557181 0.018188 0.075526 -0.237545 0.246527 -0.277073 0.049476 0.157458 0.179235 -0.160341 0.265740 -0.153173 -0.096652 -0.092870 -0.120958 -0.555433 0.068896 0.018277 0.139825 0.147594 0.152345 0.153993 0.141165 0.138004 0.141218 -0.118652 -0.109919 -0.086353 0.138056 0.154014 0.179335 0.157685 -0.163875 -0.145239 -0.236699 0.049647 0.277796 -0.276881 -0.556051 0.019211 0.246550 -0.160425 -0.096516 0.147607 0.076497 0.265284 -0.120644 -0.153106 0.139912 -0.092680 -0.554914 0.070789 0.152390 0.018709
qa: 1.4060 -0.2252 0.0820 -0.1884 0.0858 -0.1790 -0.0474 0.2883 -0.4213 -0.4977 0.3462 -0.1909 0.2814 -0.2074 -0.0915 0.2209 0.1111 -0.2430 0.0850 -0.1956 -0.1907 -0.0197 0.2833 -0.5057 -0.4191 0.0963 0.1075 0.1200 0.1238 0.0992 0.0825 0.0993 -0.0472 -0.1794 -0.1888 0.0828 0.1238 0.2211 -0.0911 0.0892 0.0859 0.3435 -0.2077 -0.2218 0.2768 0.2865 -0.4201 -0.1915 0.1147 -0.1945 0.1076 -0.4937 -0.2459 -0.0197 0.0843 0.0968 -0.1914 0.2863 -0.5037 0.1201 -0.4189
va: 2.7029 2.9446 3.7461 4.0147 3.9501 3.9620 3.8768 4.4738 2.0804 1.9236 3.8249 2.9716 4.0096 3.0501 3.4445 0.9621 3.9080 2.9446 3.7433 3.9663 4.0038 3.7832 4.4806 1.9128 2.0821 0.9720 0.9942 1.0101 1.0092 0.9722 0.9786 0.9722 3.8772 3.9621 4.0148 0.9784 1.0091 0.9620 3.4436 3.9511 3.7417 3.8308 3.0495 2.9519 4.0172 4.4753 2.0816 2.9703 3.9028 3.9677 0.9939 1.9308 2.9395 3.7843 3.7480 0.9719 4.0050 4.4725 1.9109 1.0100 2.0822
dispersion: -0.182138293 hartree
energy: -2263.337357212723 hartree
dipole: 1.34539 -1.01058 0.33481 1.44536 -0.89981 0.54555 3.95309 -3.12518 0.82791
magnitude: 1.04650 au
magnitude: 2.65998 debye
