program: Orca
programVersion: 5.0.3
elementType: Y N C C C C C C O O C N C N N H C N C C C C C O O H H H H H H H C C C H H H N C C C N N C C O N C C H O N C C H C C O H O
elementType: Y
charge: -1
multiplicity: 1
keywords: RKS CAM-B3LYP D3BJ DEF2-TZVP OPT
formula: C28H14N10O8Y
InChI: InChI=1/2C14H7N5O4.Y/c2*20-13(21)9-5-1-3-7(15-9)11-17-12(19-18-11)8-4-2-6-10(16-8)14(22)23;/h2*1-6,18H;/q2*-2;+4/rC28H14N10O8Y/c39-25-17-9-1-5-13(29-17)21-33-22(36-35-21)14-6-2-10-18(30-14)26(40)44-47(43-25)45-27(41)19-11-3-7-15(31-19)23-34-24(38-37-23)16-8-4-12-20(32-16)28(42)46-47/h1-12,35,37H
61 atoms
Y  1.483331 5.611245 -0.057435
N  2.852122 4.683076 2.258311
C  2.289498 5.007846 3.40244
C  2.848115 4.653258 4.624356
C  3.99371 4.003586 2.250716
C  4.624151 3.605693 3.414576
C  4.029521 3.940732 4.623067
C  1.000239 5.80882 3.278347
O  0.434503 6.145502 4.309868
O  0.661142 6.044069 2.081015
C  4.466541 3.776341 0.888572
N  3.798813 4.24662 -0.12406
C  4.507297 3.882553 -1.204001
N  5.596882 3.199121 -0.922906
N  5.557406 3.139585 0.424862
H  6.283464 2.661518 0.926213
C  4.00486 4.291177 -2.513963
N  2.871295 4.98123 -2.43384
C  2.308687 5.443936 -3.533711
C  4.624733 4.020979 -3.719672
C  2.856971 5.223835 -4.788484
C  4.029821 4.499197 -4.875843
C  1.032511 6.245393 -3.323885
O  0.685019 6.349957 -2.10801
O  0.474801 6.710135 -4.307838
H  4.485748 4.308437 -5.838876
H  5.545987 3.456802 -3.73882
H  2.349756 5.62932 -5.651143
H  2.34128 4.949387 5.530738
H  4.495357 3.647138 5.554828
H  5.554398 3.054031 3.388722
H  1.408605 12.192276 0.75336
C  1.381398 11.121088 0.601349
C  0.162314 10.466387 0.496104
C  2.551246 10.394582 0.52047
H  -0.768722 11.012749 0.566246
H  3.529243 10.844167 0.606279
H  -2.764211 9.36986 0.543902
N  -2.301932 8.493139 0.386559
C  0.176792 9.097407 0.308854
C  2.464982 9.021396 0.326162
C  -0.992008 8.226157 0.233146
N  -3.020486 7.351181 0.349083
N  1.307306 8.404659 0.221572
C  -2.087626 6.440383 0.168409
C  3.689048 8.117744 0.241587
O  4.790769 8.640781 0.335406
N  -0.845239 6.94251 0.081323
C  -2.233625 4.986412 0.136578
C  -3.428376 4.302671 0.264959
H  -4.355993 4.847936 0.362878
O  3.411045 6.891137 0.087759
N  -1.065162 4.363248 0.023542
C  -3.384134 2.917787 0.280477
C  -1.02135 3.045365 0.045097
H  -4.298416 2.347883 0.386022
C  -2.166662 2.273611 0.17254
C  0.372677 2.44378 -0.050186
O  1.300349 3.306865 -0.126043
H  -2.066106 1.198618 0.190295
O  0.477696 1.225443 -0.036595
totalener: -2262.94595853 hartree
nucrepener: 6266.15459563 hartree
electener: -8529.10055417 hartree
twoeener: 7089.94166732 hartree
kineticenergy: 2228.33083085 hartree
xcener: -219.562683026664 hartree
dispersion: -0.098626669 hartree
dispersion: -0.098398308 hartree
dispersion: -0.098368658 hartree
dispersion: -0.098279687 hartree
dispersion: -0.098117088 hartree
dispersion: -0.097923195 hartree
dispersion: -0.097816593 hartree
dispersion: -0.097800554 hartree
dispersion: -0.097813978 hartree
dispersion: -0.097810191 hartree
dispersion: -0.097760055 hartree
dispersion: -0.097667757 hartree
dispersion: -0.097548505 hartree
dispersion: -0.097424443 hartree
dispersion: -0.097300002 hartree
dispersion: -0.097175960 hartree
dispersion: -0.097037496 hartree
dispersion: -0.096890620 hartree
dispersion: -0.096721107 hartree
dispersion: -0.096574275 hartree
dispersion: -0.096465376 hartree
dispersion: -0.096355098 hartree
dispersion: -0.096293700 hartree
dispersion: -0.096261976 hartree
dispersion: -0.096270554 hartree
dispersion: -0.096316559 hartree
dispersion: -0.096348518 hartree
dispersion: -0.096355787 hartree
chargesum: -1.0000000
charge: 1.354656 -0.219657 0.071771 -0.201365 0.098368 -0.182173 -0.068474 0.260808 -0.407916 -0.486462 0.318170 -0.189438 0.250012 -0.189203 -0.097122 0.229404 0.116801 -0.235351 0.077563 -0.200701 -0.203985 -0.039121 0.247907 -0.487136 -0.403704 0.113807 0.127230 0.139062 0.142941 0.116710 0.103284 0.117247 -0.068243 -0.183093 -0.201358 0.103321 0.143319 0.229939 -0.098930 0.119405 0.079879 0.302447 -0.189029 -0.212354 0.232847 0.262759 -0.405775 -0.190792 0.127395 -0.202435 0.127487 -0.473997 -0.236174 -0.038181 0.076968 0.114494 -0.205548 0.261934 -0.484702 0.139118 -0.404635
charge: 0.282270 0.281072 -0.148304 -0.089307 -0.165468 -0.112879 -0.118843 -0.568791 0.019640 0.077780 -0.241117 0.248359 -0.282931 0.052354 0.158606 0.182617 -0.160929 0.271052 -0.154536 -0.099333 -0.095520 -0.120818 -0.565417 0.069892 0.021501 0.142902 0.150886 0.155872 0.157380 0.144331 0.141227 0.144438 -0.118400 -0.112403 -0.088503 0.141306 0.157614 0.182782 0.159102 -0.164394 -0.146470 -0.240197 0.052939 0.282817 -0.283028 -0.566299 0.021840 0.247960 -0.161970 -0.099224 0.150874 0.079021 0.269794 -0.120524 -0.155312 0.143029 -0.095385 -0.564960 0.072900 0.155804 0.021303
qa: 1.3547 -0.2197 0.0718 -0.2014 0.0984 -0.1822 -0.0685 0.2608 -0.4079 -0.4865 0.3182 -0.1894 0.2500 -0.1892 -0.0971 0.2294 0.1168 -0.2354 0.0776 -0.2007 -0.2040 -0.0391 0.2479 -0.4871 -0.4037 0.1138 0.1272 0.1391 0.1429 0.1167 0.1033 0.1172 -0.0682 -0.1831 -0.2014 0.1033 0.1433 0.2299 -0.0989 0.1194 0.0799 0.3024 -0.1890 -0.2124 0.2328 0.2628 -0.4058 -0.1908 0.1274 -0.2024 0.1275 -0.4740 -0.2362 -0.0382 0.0770 0.1145 -0.2055 0.2619 -0.4847 0.1391 -0.4046
va: 2.7583 2.9239 3.7357 4.0241 3.9470 3.9579 3.8844 4.5304 2.0973 1.9082 3.8417 2.9451 4.0481 3.0714 3.4448 0.9578 3.8930 2.9276 3.7294 3.9638 4.0100 3.7869 4.5520 1.9212 2.1018 0.9734 0.9936 1.0082 1.0065 0.9734 0.9787 0.9732 3.8832 3.9579 4.0232 0.9784 1.0067 0.9576 3.4393 3.9316 3.7258 3.8641 3.0674 2.9321 4.0695 4.5260 2.0992 2.9510 3.8859 3.9656 0.9929 1.9309 2.9242 3.7882 3.7338 0.9730 4.0113 4.5232 1.9116 1.0079 2.1000
dispersion: -0.096360772 hartree
energy: -2263.463323172218 hartree
dipole: 1.80270 -1.45417 0.34853 1.27114 -0.70654 0.56460 9.33108 -8.18405 1.14703
magnitude: 1.32511 au
magnitude: 3.36817 debye
