program: Orca
programVersion: 5.0.3
elementType: Y N C C C C C C O O C N C N N H C N C C C C C O O H H H H H H H C C C H H H N C C C N N C C O N C C H O N C C H C C O H O
elementType: Y
charge: -1
multiplicity: 1
keywords: RKS WB97X-D3BJ DEF2-TZVP OPT
formula: C28H14N10O8Y
InChI: InChI=1/2C14H7N5O4.Y/c2*20-13(21)9-5-1-3-7(15-9)11-17-12(19-18-11)8-4-2-6-10(16-8)14(22)23;/h2*1-6,18H;/q2*-2;+4/rC28H14N10O8Y/c39-25-17-9-1-5-13(29-17)21-33-22(36-35-21)14-6-2-10-18(30-14)26(40)44-47(43-25)45-27(41)19-11-3-7-15(31-19)23-34-24(38-37-23)16-8-4-12-20(32-16)28(42)46-47/h1-12,35,37H
61 atoms
Y  1.468717 5.599211 -0.118461
N  2.797196 4.694738 2.224601
C  2.221118 5.030703 3.363936
C  2.779052 4.711609 4.601514
C  3.955657 4.03469 2.244948
C  4.588235 3.669787 3.421971
C  3.977282 4.01959 4.624377
C  0.91122 5.805839 3.216161
O  0.331779 6.149773 4.242669
O  0.573808 6.012143 2.00979
C  4.447256 3.791654 0.883932
N  3.775829 4.240962 -0.139893
C  4.504572 3.87776 -1.212491
N  5.607216 3.214677 -0.917318
N  5.555004 3.167764 0.435321
H  6.285583 2.709311 0.94924
C  4.006633 4.281338 -2.533652
N  2.86933 4.975256 -2.46065
C  2.320016 5.435502 -3.573531
C  4.641057 4.004434 -3.733996
C  2.880848 5.209794 -4.826966
C  4.056508 4.480555 -4.902507
C  1.040002 6.247683 -3.382006
O  0.675266 6.356836 -2.16836
O  0.49884 6.715243 -4.378516
H  4.522379 4.28535 -5.862976
H  5.564172 3.437998 -3.739279
H  2.380927 5.615397 -5.696856
H  2.258797 5.018058 5.499733
H  4.443561 3.754085 5.567516
H  5.531671 3.135162 3.410414
H  1.467073 12.170058 0.842931
C  1.429576 11.10056 0.663883
C  0.200128 10.456183 0.545036
C  2.595251 10.362401 0.561195
H  -0.729694 11.007602 0.629933
H  3.580499 10.799998 0.656905
H  -2.722632 9.354815 0.723747
N  -2.27819 8.486746 0.484841
C  0.204338 9.088977 0.323376
C  2.494331 8.991085 0.330888
C  -0.97869 8.22483 0.240523
N  -3.004588 7.344678 0.448191
N  1.328995 8.38119 0.213874
C  -2.083631 6.441416 0.170041
C  3.715509 8.076378 0.221677
O  4.824724 8.590693 0.327477
N  -0.842604 6.946172 0.018752
C  -2.228787 4.980179 0.136531
C  -3.420809 4.298184 0.322892
H  -4.34408 4.848342 0.456456
O  3.424884 6.85433 0.035389
N  -1.058987 4.35896 -0.017606
C  -3.375982 2.908631 0.355416
C  -1.017538 3.036841 0.021518
H  -4.286611 2.338731 0.509733
C  -2.158987 2.262774 0.206298
C  0.377433 2.42912 -0.111886
O  1.306592 3.292332 -0.216823
H  -2.054663 1.185983 0.237732
O  0.478989 1.206647 -0.096308
totalener: -2264.51592979 hartree
nucrepener: 6266.15459563 hartree
electener: -8530.67052542 hartree
twoeener: 7087.29998730 hartree
kineticenergy: 2230.25679317 hartree
exchangeener: -196.476471914719 hartree
correlationener: -14.108701678369 hartree
xcener: -210.585173593087 hartree
dispersion: -0.213424013 hartree
dispersion: -0.212138898 hartree
dispersion: -0.211530551 hartree
dispersion: -0.210971895 hartree
dispersion: -0.210470219 hartree
dispersion: -0.210182038 hartree
dispersion: -0.210287614 hartree
dispersion: -0.210686124 hartree
dispersion: -0.211155974 hartree
dispersion: -0.211540557 hartree
dispersion: -0.211753887 hartree
dispersion: -0.211796419 hartree
dispersion: -0.211728446 hartree
dispersion: -0.211620408 hartree
dispersion: -0.211503639 hartree
dispersion: -0.211379466 hartree
dispersion: -0.211231790 hartree
dispersion: -0.211057160 hartree
dispersion: -0.210848377 hartree
dispersion: -0.210622952 hartree
dispersion: -0.210505607 hartree
dispersion: -0.210306243 hartree
dispersion: -0.210110834 hartree
dispersion: -0.209955536 hartree
dispersion: -0.209916250 hartree
dispersion: -0.209943307 hartree
dispersion: -0.210014240 hartree
dispersion: -0.210161506 hartree
dispersion: -0.210192897 hartree
dispersion: -0.210194620 hartree
dispersion: -0.210217949 hartree
dispersion: -0.210233005 hartree
chargesum: -1.0000000
charge: 1.058296 -0.226503 0.133091 -0.209722 0.121679 -0.226562 -0.039733 0.256457 -0.429717 -0.479217 0.329705 -0.174121 0.273597 -0.197367 -0.079694 0.232120 0.134813 -0.230970 0.139787 -0.230372 -0.213612 -0.013647 0.246770 -0.465543 -0.424825 0.109442 0.122642 0.136610 0.139962 0.112892 0.097631 0.113620 -0.038294 -0.227152 -0.212697 0.098123 0.140522 0.232777 -0.087445 0.165691 0.141810 0.294937 -0.197213 -0.215527 0.237056 0.265112 -0.427543 -0.178414 0.158037 -0.230527 0.123010 -0.461182 -0.230828 -0.012331 0.139248 0.110167 -0.215942 0.265646 -0.464867 0.136494 -0.426174
charge: 0.297327 0.274161 -0.143576 -0.088685 -0.161048 -0.112279 -0.114566 -0.559872 0.012185 0.069525 -0.236354 0.242114 -0.276276 0.049265 0.158569 0.180124 -0.155988 0.265781 -0.148973 -0.098892 -0.094827 -0.116576 -0.555048 0.061854 0.015336 0.140307 0.148497 0.153530 0.154939 0.141796 0.139017 0.141918 -0.114123 -0.111850 -0.087920 0.139121 0.155263 0.180502 0.159598 -0.160064 -0.141634 -0.235932 0.050686 0.276059 -0.276931 -0.557653 0.014688 0.240836 -0.157612 -0.098637 0.148495 0.070827 0.264404 -0.116337 -0.150202 0.140433 -0.094813 -0.554541 0.065657 0.153403 0.014996
qa: 1.0583 -0.2265 0.1331 -0.2097 0.1217 -0.2266 -0.0397 0.2565 -0.4297 -0.4792 0.3297 -0.1741 0.2736 -0.1974 -0.0797 0.2321 0.1348 -0.2310 0.1398 -0.2304 -0.2136 -0.0136 0.2468 -0.4655 -0.4248 0.1094 0.1226 0.1366 0.1400 0.1129 0.0976 0.1136 -0.0383 -0.2272 -0.2127 0.0981 0.1405 0.2328 -0.0874 0.1657 0.1418 0.2949 -0.1972 -0.2155 0.2371 0.2651 -0.4275 -0.1784 0.1580 -0.2305 0.1230 -0.4612 -0.2308 -0.0123 0.1392 0.1102 -0.2159 0.2656 -0.4649 0.1365 -0.4262
va: 3.2846 2.9724 3.7579 4.0443 3.8676 3.9975 3.9151 4.5239 2.1010 1.9217 3.8842 3.0026 4.0479 3.1249 3.4781 0.9559 3.8575 2.9851 3.7451 3.9949 4.0312 3.8228 4.5468 1.9585 2.1071 0.9736 0.9925 1.0028 1.0011 0.9733 0.9797 0.9728 3.9133 3.9986 4.0450 0.9789 1.0014 0.9557 3.4713 3.8590 3.7426 3.9096 3.1128 2.9805 4.0862 4.5137 2.1033 3.0131 3.8615 3.9976 0.9916 1.9497 2.9792 3.8257 3.7499 0.9728 4.0317 4.5095 1.9461 1.0026 2.1047
dispersion: -0.210236016 hartree
energy: -2265.154158942829 hartree
dipole: 2.63598 -2.22918 0.40680 1.94959 -1.31760 0.63199 12.81415 -11.42771 1.38644
magnitude: 1.57706 au
magnitude: 4.00856 debye
