program: Orca
programVersion: 5.0.3
elementType: C H C H C H C C C N C N C H C C C H C N C H C C Y N C C C H H O O C O O N C C C H H C H H O O O O H H H C H H H H C H H
elementType: Y
charge: -1
multiplicity: 1
keywords: RKS PBE D3BJ DEF2-TZVP OPT
formula: C25H21N5O8Y
InChI: InChI=1/C25H21N5O8.Y/c31-22(32)12-29(13-23(33)34)10-16-4-1-6-18(26-16)20-8-3-9-21(28-20)19-7-2-5-17(27-19)11-30(14-24(35)36)15-25(37)38;/h1-9H,10-15H2;/q-4;+4/rC25H21N5O8Y/c31-22-12-29-10-16-4-1-6-18(26-16)20-8-3-9-21(28-20)19-7-2-5-17(27-19)11-30-14-24(33)37-39(29,30,35-22,36-23(32)13-29)38-25(34)15-30/h1-9H,10-15H2
60 atoms
C  5.179418 -1.020145 8.407045
H  4.375506 -1.110597 7.678126
C  6.116797 -0.000129 8.299491
H  6.07687 0.705134 7.467845
C  7.070116 0.133229 9.301904
H  7.799356 0.943547 9.290241
C  5.237873 -1.889902 9.505685
C  7.068269 -0.773874 10.366127
C  4.187966 -2.914462 9.697609
N  6.180681 -1.779037 10.459225
C  3.473972 -3.419549 8.599669
N  3.931531 -3.29317 10.960426
C  2.425108 -4.299551 8.830265
H  3.760506 -3.147301 7.584834
C  2.893874 -4.116566 11.185931
C  2.112497 -4.635823 10.141034
C  2.648884 -4.540879 12.583537
H  1.308732 -5.339411 10.347289
C  1.465372 -5.19523 12.953507
N  3.654045 -4.347627 13.459272
C  1.366002 -5.748865 14.225724
H  0.633531 -5.275415 12.255967
C  3.592847 -4.959087 14.650461
C  2.466629 -5.676964 15.070452
Y  5.912404 -2.926702 12.9025
N  7.504756 -0.814641 12.803971
C  8.60582 -1.123883 13.7292
C  6.664631 0.332297 13.185724
C  9.049959 -2.59483 13.556042
H  8.253957 -0.99573 14.761574
H  9.477461 -0.458937 13.581507
O  8.151446 -3.369574 13.0251
O  10.170203 -2.932833 13.947492
C  5.198613 0.21515 12.683875
O  4.608741 1.249877 12.3476
O  4.708708 -0.980883 12.708857
N  6.063556 -4.754682 14.805648
C  7.067856 -4.218202 15.737529
C  6.432496 -6.016738 14.138469
C  6.796907 -2.716237 15.98735
H  8.062103 -4.311003 15.280842
H  7.077872 -4.756056 16.704357
C  5.910807 -6.137919 12.677158
H  7.529272 -6.036251 14.05966
H  6.108582 -6.89986 14.717815
O  6.091926 -2.1395 15.060708
O  7.273003 -2.177216 16.990404
O  5.557825 -7.253849 12.274026
O  5.943728 -5.042715 11.99371
H  1.865496 -4.730294 7.998579
H  0.454993 -6.263592 14.53549
H  2.46916 -6.162234 16.047194
C  8.080775 -0.674109 11.466189
H  6.602261 0.335141 14.283496
H  8.639324 0.280066 11.370908
H  8.804331 -1.495628 11.332772
H  7.094694 1.293775 12.850193
C  4.797067 -4.835265 15.534094
H  4.805501 -5.677245 16.257717
H  4.693227 -3.905443 16.11757
totalener: -1877.99271574 hartree
nucrepener: 5022.37369386 hartree
electener: -6900.36640960 hartree
twoeener: 5711.63021336 hartree
kineticenergy: 1844.26774016 hartree
exchangeener: -240.636681744303 hartree
correlationener: -9.622701179127 hartree
xcener: -250.259382923430 hartree
dispersion: -0.109658029 hartree
dispersion: -0.109350303 hartree
dispersion: -0.109106310 hartree
dispersion: -0.108715357 hartree
dispersion: -0.108267694 hartree
dispersion: -0.107856339 hartree
dispersion: -0.107526046 hartree
dispersion: -0.107267466 hartree
dispersion: -0.107061104 hartree
dispersion: -0.106887524 hartree
dispersion: -0.106732985 hartree
dispersion: -0.106590637 hartree
dispersion: -0.106459579 hartree
dispersion: -0.106343353 hartree
dispersion: -0.106248366 hartree
dispersion: -0.106181917 hartree
dispersion: -0.106150433 hartree
dispersion: -0.106157899 hartree
dispersion: -0.106204936 hartree
dispersion: -0.106288858 hartree
dispersion: -0.106404791 hartree
dispersion: -0.106545604 hartree
dispersion: -0.106702947 hartree
dispersion: -0.106868517 hartree
dispersion: -0.107033482 hartree
dispersion: -0.107196005 hartree
dispersion: -0.107341327 hartree
dispersion: -0.107425254 hartree
dispersion: -0.107435086 hartree
dispersion: -0.107447610 hartree
dispersion: -0.107447908 hartree
chargesum: -1.0000000
charge: -0.180886 0.096033 -0.077909 0.097154 -0.192978 0.096389 0.204128 0.213783 0.194961 -0.173916 -0.164727 -0.148536 -0.102589 0.105008 0.214421 -0.159669 0.178596 0.089491 -0.154865 -0.187170 -0.080502 0.090895 0.238096 -0.216242 0.787831 -0.135571 -0.111920 -0.079400 0.188293 0.154314 0.054495 -0.421827 -0.357897 0.225818 -0.379313 -0.397663 -0.135707 -0.119056 -0.084786 0.185292 0.160401 0.053279 0.228786 0.119762 0.052820 -0.433541 -0.355399 -0.382511 -0.401464 0.098037 0.097209 0.096268 -0.168415 0.127496 0.081153 0.151269 0.048615 -0.169610 0.091920 0.152056
charge: -0.102147 0.148822 -0.117967 0.146001 -0.101705 0.150193 -0.143146 -0.178292 -0.142128 0.279383 -0.098951 0.293359 -0.122597 0.149493 -0.139867 -0.092749 -0.138940 0.148560 -0.103401 0.281403 -0.121754 0.146863 -0.178427 -0.104989 0.053898 0.160397 -0.250016 -0.244362 -0.614219 0.163536 0.130002 0.075734 0.037794 -0.603258 0.022245 0.078264 0.160486 -0.250913 -0.240439 -0.619244 0.163851 0.129711 -0.605932 0.160444 0.127901 0.073170 0.037510 0.019424 0.079923 0.146350 0.145649 0.149697 -0.228260 0.161781 0.135474 0.174913 0.126067 -0.229328 0.137559 0.177173
qa: -0.1809 0.0960 -0.0779 0.0972 -0.1930 0.0964 0.2041 0.2138 0.1950 -0.1739 -0.1647 -0.1485 -0.1026 0.1050 0.2144 -0.1597 0.1786 0.0895 -0.1549 -0.1872 -0.0805 0.0909 0.2381 -0.2162 0.7878 -0.1356 -0.1119 -0.0794 0.1883 0.1543 0.0545 -0.4218 -0.3579 0.2258 -0.3793 -0.3977 -0.1357 -0.1191 -0.0848 0.1853 0.1604 0.0533 0.2288 0.1198 0.0528 -0.4335 -0.3554 -0.3825 -0.4015 0.0980 0.0972 0.0963 -0.1684 0.1275 0.0812 0.1513 0.0486 -0.1696 0.0919 0.1521
va: 4.0152 0.9811 3.9975 0.9680 4.0371 0.9798 3.8062 3.9451 3.8681 3.0869 3.9913 3.0926 4.0027 0.9785 3.9125 4.0116 3.8584 0.9849 3.9685 3.0518 3.9763 0.9809 3.9093 4.0011 3.7908 3.0811 3.7228 3.7141 4.4541 0.9955 0.9990 2.0022 2.1694 4.4589 2.1442 2.0044 3.0750 3.7492 3.7274 4.4545 0.9861 0.9982 4.4493 0.9801 1.0063 1.9913 2.1734 2.1386 1.9990 0.9695 0.9674 0.9784 3.9341 0.9868 0.9753 0.9652 1.0038 3.9217 0.9724 0.9707
dispersion: -0.107460605 hartree
energy: -1878.316907741044 hartree
dipole: -23.29678 19.51316 -3.78362 -4.16233 3.50407 -0.65826 -19.74354 16.22044 -3.52310
magnitude: 5.21165 au
magnitude: 13.24697 debye
