program: Orca
programVersion: 5.0.3
elementType: Y N N N O O N O O O C C C C C C C C C C H H H H C C H H H H C C C H H C H H O O H H C C C H H C H H O O H H
elementType: Y
charge: -1
multiplicity: 1
keywords: RKS B3LYP D3BJ DEF2-TZVP OPT
formula: C20H20N4O9Y
InChI: InChI=1/C20H18N4O8.H2O.Y/c25-17(26)9-23(10-18(27)28)7-13-3-1-5-15(21-13)16-6-2-4-14(22-16)8-24(11-19(29)30)12-20(31)32;;/h1-6H,7-12H2;1H2;/q-6;;+6/rC20H20N4O9Y/c25-17-9-23-7-13-3-1-5-15-16-6-2-4-14-8-24-11-19(27)32-34(23,24,29,30-17,21(13)15,22(14)16,31-18(26)10-23)33-20(28)12-24/h1-6H,7-12,29H2
54 atoms
Y  1.014362 -3.664141 1.833819
N  2.072336 -5.827893 1.811858
N  -0.066923 -5.400063 3.0800
N  -0.093559 -2.730385 3.821234
O  2.364881 -3.759185 3.658436
O  -1.259316 -3.376956 1.576159
N  3.233892 -3.551196 0.78516
O  0.92094 -4.788689 -0.152965
O  1.795374 -1.516715 1.946716
O  0.458956 -2.254106 -0.00186
C  3.297968 -5.946014 1.30568
C  1.304021 -6.917803 1.935852
C  3.799116 -7.165821 0.865892
C  2.993707 -8.290804 0.957666
C  1.726336 -8.171198 1.506387
C  0.031792 -6.658685 2.635791
C  -0.944836 -7.606947 2.922581
C  -2.009393 -7.228735 3.729422
C  -2.040942 -5.951984 4.271903
C  -1.028168 -5.060967 3.929592
H  4.790921 -7.219626 0.438512
H  1.081923 -9.03353 1.599029
H  -0.877164 -8.611451 2.530998
H  -2.832172 -5.646169 4.942877
C  -0.843597 -3.732016 4.606173
C  4.071297 -4.663479 1.263746
H  -2.797688 -7.936165 3.954227
H  3.346822 -9.249941 0.601307
H  -0.273261 -3.95116 5.51361
H  -1.808905 -3.331246 4.931175
C  0.963484 -2.126334 4.658815
C  -1.042827 -1.75118 3.267705
C  2.209058 -3.037569 4.706602
H  0.612125 -1.909943 5.67254
H  1.275398 -1.196199 4.188463
C  -1.888522 -2.426551 2.170355
H  -1.691713 -1.316968 4.036028
H  -0.465998 -0.945736 2.810669
O  2.942371 -2.98321 5.688804
O  -3.01701 -2.011604 1.934427
H  4.974992 -4.776498 0.650874
H  4.361285 -4.435549 2.29091
C  3.888393 -2.263029 1.10526
C  2.979773 -3.693169 -0.669025
C  1.865043 -4.7159 -1.012455
H  3.899338 -3.962861 -1.199178
H  2.636438 -2.730597 -1.044891
C  2.901774 -1.125519 1.425771
H  4.474252 -2.395753 2.015931
H  4.568671 -1.94958 0.309149
O  1.966726 -5.33697 -2.066815
O  3.250745 0.029418 1.214612
H  -0.451574 -2.531646 -0.179517
H  0.442835 -1.361643 0.368846
totalener: -1708.44063167 hartree
nucrepener: 4224.04050577 hartree
electener: -5932.48113744 hartree
twoeener: 4856.27379972 hartree
kineticenergy: 1674.87606991 hartree
exchangeener: -172.184640050300 hartree
correlationener: -10.301970559821 hartree
xcener: -182.486610610121 hartree
dispersion: -0.164877972 hartree
dispersion: -0.165224542 hartree
dispersion: -0.165452650 hartree
dispersion: -0.165471212 hartree
dispersion: -0.165387478 hartree
dispersion: -0.165279355 hartree
dispersion: -0.165182147 hartree
dispersion: -0.165104261 hartree
dispersion: -0.165042339 hartree
dispersion: -0.164993294 hartree
dispersion: -0.164955101 hartree
dispersion: -0.164925829 hartree
dispersion: -0.164903475 hartree
dispersion: -0.164885197 hartree
dispersion: -0.164867338 hartree
dispersion: -0.164846418 hartree
dispersion: -0.164820372 hartree
dispersion: -0.164788461 hartree
dispersion: -0.164750459 hartree
dispersion: -0.164705461 hartree
dispersion: -0.164652090 hartree
dispersion: -0.164592189 hartree
dispersion: -0.164529205 hartree
dispersion: -0.164464675 hartree
dispersion: -0.164398429 hartree
dispersion: -0.164330522 hartree
dispersion: -0.164260566 hartree
dispersion: -0.164190355 hartree
dispersion: -0.164128364 hartree
dispersion: -0.164073464 hartree
dispersion: -0.164035377 hartree
dispersion: -0.164021407 hartree
dispersion: -0.164030934 hartree
dispersion: -0.164043148 hartree
dispersion: -0.164038939 hartree
dispersion: -0.164025241 hartree
dispersion: -0.164001995 hartree
dispersion: -0.163998928 hartree
dispersion: -0.163999512 hartree
dispersion: -0.164005576 hartree
chargesum: -1.0000000
charge: 0.834493 -0.130320 -0.148863 -0.087876 -0.488705 -0.520640 -0.125094 -0.475832 -0.557247 -0.573180 0.156368 0.266941 -0.179058 -0.052214 -0.197591 0.204578 -0.200923 -0.050336 -0.235809 0.192824 0.103678 0.095180 0.104473 0.105977 -0.150525 -0.136032 0.106128 0.102800 0.127075 0.118129 -0.116363 -0.128676 0.260525 0.073592 0.136075 0.266935 0.069976 0.139085 -0.417866 -0.398472 0.084517 0.153362 -0.122081 -0.067377 0.291464 0.062471 0.127129 0.296983 0.100704 0.089684 -0.414294 -0.406444 0.358101 0.352571
charge: -0.117762 0.299514 0.287515 0.157969 0.065933 0.047889 0.157217 0.070526 0.042832 -0.096326 -0.167948 -0.131821 -0.095545 -0.106898 -0.094599 -0.126675 -0.099050 -0.107057 -0.101178 -0.162839 0.147072 0.143618 0.144344 0.147439 -0.189852 -0.210175 0.144131 0.143405 0.164095 0.145019 -0.233057 -0.238040 -0.598140 0.124313 0.156456 -0.613400 0.125752 0.154358 0.005862 0.015179 0.131309 0.164423 -0.221960 -0.223500 -0.602657 0.126508 0.154519 -0.599410 0.153242 0.132225 0.008674 0.017074 0.183881 0.175593
qa: 0.8345 -0.1303 -0.1489 -0.0879 -0.4887 -0.5206 -0.1251 -0.4758 -0.5572 -0.5732 0.1564 0.2669 -0.1791 -0.0522 -0.1976 0.2046 -0.2009 -0.0503 -0.2358 0.1928 0.1037 0.0952 0.1045 0.1060 -0.1505 -0.1360 0.1061 0.1028 0.1271 0.1181 -0.1164 -0.1287 0.2605 0.0736 0.1361 0.2669 0.0700 0.1391 -0.4179 -0.3985 0.0845 0.1534 -0.1221 -0.0674 0.2915 0.0625 0.1271 0.2970 0.1007 0.0897 -0.4143 -0.4064 0.3581 0.3526
va: 3.5572 3.0566 2.9445 2.9920 1.8615 1.7951 2.9775 1.8752 1.7939 1.9499 3.8800 3.7928 4.0030 3.9622 4.0148 3.8344 3.9878 3.9302 4.0186 3.9006 0.9772 0.9825 0.9803 0.9784 3.9540 3.8640 0.9705 0.9713 0.9635 0.9669 3.6338 3.6065 4.4472 0.9899 0.9899 4.3952 1.0009 0.9971 2.0772 2.1005 0.9672 0.9690 3.7452 3.6131 4.3770 0.9987 0.9740 4.4101 0.9794 0.9880 2.0784 2.0858 0.9021 0.8978
dispersion: -0.164012217 hartree
energy: -1708.835406274434 hartree
dipole: 8.57443 -8.84515 -0.27072 -29.98400 25.62389 -4.36011 15.44300 -13.90482 1.53818
magnitude: 4.63140 au
magnitude: 11.77207 debye
