program: Orca
programVersion: 5.0.3
elementType: Y N N O O O O O O O C C C C C C H C C H H H H C C C C C H H C H H C H H C H H O O O O H H H H C N H
elementType: Y
charge: -2
multiplicity: 1
keywords: RKS B3LYP D3BJ DEF2-TZVP OPT
formula: C17H18N3O11Y
InChI: InChI=1/C17H14N3O9.2H2O.Y/c18-3-10-1-11(4-19(6-13(21)22)7-14(23)24)17(29)12(2-10)5-20(8-15(25)26)9-16(27)28;;;/h1-2H,4-9H2;2*1H2;/q-5;;;+5/rC17H18N3O11Y/c18-3-10-1-11-4-19-6-13(21)27-32(19,25,26,28-14(22)7-19)20(8-15(23)29-32,9-16(24)30-32)5-12(2-10)17(11)31-32/h1-2H,4-9,25-26H2
50 atoms
Y  -6.79257 -6.847552 -8.627546
N  -9.120229 -6.196036 -7.598374
N  -4.537952 -6.873613 -7.337587
O  -8.433513 -8.407835 -8.82816
O  -6.859459 -7.955646 -6.622647
O  -6.623454 -5.120262 -7.690982
O  -5.007456 -6.105015 -9.860636
O  -6.801302 -7.513705 -10.84756
O  -5.856595 -8.948161 -8.895373
O  -8.067411 -5.520085 -10.028315
C  -6.663147 -5.097502 -6.403516
C  -5.45933 -5.269257 -5.688599
C  -5.479557 -5.239441 -4.31314
C  -6.698487 -5.070134 -3.626424
C  -7.906787 -5.025196 -4.353043
C  -7.902345 -5.055475 -5.728872
H  -8.845409 -4.9874 -3.811662
C  -9.106842 -5.074917 -6.621252
C  -4.300585 -5.606134 -6.576132
H  -9.097311 -4.15913 -7.217771
H  -10.033818 -5.072042 -6.028992
H  -3.371147 -5.700165 -5.997219
H  -4.16865 -4.817149 -7.317932
C  -9.99879 -5.802221 -8.715496
C  -9.62866 -7.44351 -7.014918
C  -4.521192 -7.995201 -6.382734
C  -3.460948 -7.007434 -8.329661
C  -9.260975 -5.096128 -9.857042
H  -10.839653 -5.189615 -8.36961
H  -10.419164 -6.704635 -9.161486
C  -9.381982 -8.612164 -7.989404
H  -10.701469 -7.380659 -6.784282
H  -9.077992 -7.663676 -6.102295
C  -5.918888 -8.309283 -5.832937
H  -3.823454 -7.828402 -5.554467
H  -4.198017 -8.894008 -6.90883
C  -3.757872 -6.2467 -9.629449
H  -3.391117 -8.057628 -8.616293
H  -2.484484 -6.703205 -7.932394
O  -9.86738 -4.27205 -10.541982
O  -10.080889 -9.620673 -7.895067
O  -6.016612 -8.912318 -4.767389
O  -2.819258 -5.911276 -10.350403
H  -7.551952 -6.917535 -11.040329
H  -6.439516 -9.335843 -8.222124
H  -6.008866 -6.968739 -11.036158
H  -6.309594 -9.128829 -9.733838
C  -6.71482 -4.97749 -2.211059
N  -6.727815 -4.876832 -1.057085
H  -4.567994 -5.380941 -3.7442
totalener: -1688.70015812 hartree
nucrepener: 3830.15730248 hartree
electener: -5518.85746061 hartree
twoeener: 4487.39866163 hartree
kineticenergy: 1656.87872080 hartree
exchangeener: -167.512795557884 hartree
correlationener: -9.943703267370 hartree
xcener: -177.456498825254 hartree
dispersion: -0.142720623 hartree
dispersion: -0.142842734 hartree
dispersion: -0.142942103 hartree
dispersion: -0.142968462 hartree
dispersion: -0.142886757 hartree
dispersion: -0.142640978 hartree
dispersion: -0.142451554 hartree
dispersion: -0.142359153 hartree
dispersion: -0.142326555 hartree
dispersion: -0.142303511 hartree
dispersion: -0.142268735 hartree
dispersion: -0.142228926 hartree
dispersion: -0.142196189 hartree
dispersion: -0.142185996 hartree
dispersion: -0.142213537 hartree
dispersion: -0.142290555 hartree
dispersion: -0.142418068 hartree
dispersion: -0.142590149 hartree
dispersion: -0.142776543 hartree
dispersion: -0.143016565 hartree
dispersion: -0.143275736 hartree
dispersion: -0.143533685 hartree
dispersion: -0.143766159 hartree
dispersion: -0.143952770 hartree
dispersion: -0.144173056 hartree
dispersion: -0.144397302 hartree
dispersion: -0.144627867 hartree
dispersion: -0.144819104 hartree
dispersion: -0.145039435 hartree
dispersion: -0.145237729 hartree
dispersion: -0.145529423 hartree
dispersion: -0.145620242 hartree
dispersion: -0.146030155 hartree
dispersion: -0.146106565 hartree
dispersion: -0.146178409 hartree
dispersion: -0.146174042 hartree
dispersion: -0.146207313 hartree
dispersion: -0.146195418 hartree
dispersion: -0.146217407 hartree
dispersion: -0.146233479 hartree
dispersion: -0.146310780 hartree
dispersion: -0.146440541 hartree
dispersion: -0.146617684 hartree
dispersion: -0.146834908 hartree
dispersion: -0.147005006 hartree
dispersion: -0.147138490 hartree
dispersion: -0.147214538 hartree
dispersion: -0.147298479 hartree
dispersion: -0.147423170 hartree
dispersion: -0.147515465 hartree
dispersion: -0.147714361 hartree
dispersion: -0.147764936 hartree
dispersion: -0.147945533 hartree
dispersion: -0.147975882 hartree
dispersion: -0.147985306 hartree
dispersion: -0.147908872 hartree
dispersion: -0.147860475 hartree
dispersion: -0.147775658 hartree
dispersion: -0.147698583 hartree
dispersion: -0.147629854 hartree
dispersion: -0.147582640 hartree
dispersion: -0.147565464 hartree
dispersion: -0.147593933 hartree
dispersion: -0.147685399 hartree
dispersion: -0.147850353 hartree
dispersion: -0.147999046 hartree
dispersion: -0.148261713 hartree
dispersion: -0.148128620 hartree
dispersion: -0.148046980 hartree
dispersion: -0.148140742 hartree
dispersion: -0.148248423 hartree
dispersion: -0.148232106 hartree
dispersion: -0.148230909 hartree
dispersion: -0.148217923 hartree
dispersion: -0.148250636 hartree
dispersion: -0.148324242 hartree
dispersion: -0.148363051 hartree
dispersion: -0.148417247 hartree
dispersion: -0.148373456 hartree
dispersion: -0.148395780 hartree
dispersion: -0.148434738 hartree
dispersion: -0.148438167 hartree
dispersion: -0.148404619 hartree
dispersion: -0.148426145 hartree
dispersion: -0.148435437 hartree
dispersion: -0.148444805 hartree
dispersion: -0.148439900 hartree
dispersion: -0.148433222 hartree
dispersion: -0.148423334 hartree
dispersion: -0.148415124 hartree
dispersion: -0.148412549 hartree
dispersion: -0.148416601 hartree
dispersion: -0.148438040 hartree
dispersion: -0.148469915 hartree
dispersion: -0.148514048 hartree
dispersion: -0.148547476 hartree
dispersion: -0.148553188 hartree
dispersion: -0.148552934 hartree
dispersion: -0.148522059 hartree
dispersion: -0.148539272 hartree
dispersion: -0.148550526 hartree
chargesum: -2.0000000
charge: 1.036360 -0.136244 -0.137314 -0.496641 -0.550460 -0.495409 -0.528329 -0.609431 -0.578799 -0.530482 0.280864 -0.011124 -0.288755 0.321020 -0.313448 0.098697 0.072595 -0.096281 -0.117220 0.108226 0.046365 0.063400 0.111905 -0.095273 -0.072616 -0.106563 -0.054258 0.261972 0.044975 0.100212 0.276910 0.035283 0.129261 0.337711 0.046792 0.086091 0.234131 0.090023 0.046708 -0.438629 -0.443184 -0.435637 -0.433703 0.353186 0.363916 0.346819 0.364579 -0.313062 -0.044707 0.069568
charge: -0.238708 0.153123 0.156569 0.040323 0.073534 0.156958 0.054709 -0.141252 -0.102185 0.046268 -0.247712 -0.124349 -0.067984 -0.173229 -0.069339 -0.116947 0.143865 -0.207016 -0.203111 0.155088 0.123252 0.121224 0.156388 -0.237013 -0.250237 -0.243374 -0.248020 -0.600219 0.122037 0.155804 -0.598683 0.116820 0.153089 -0.610020 0.124033 0.141681 -0.601393 0.145181 0.121584 -0.016275 -0.015586 -0.000542 -0.013117 0.177785 0.190150 0.173166 0.180771 -0.183133 -0.017754 0.143799
qa: 1.0364 -0.1362 -0.1373 -0.4966 -0.5505 -0.4954 -0.5283 -0.6094 -0.5788 -0.5305 0.2809 -0.0111 -0.2888 0.3210 -0.3134 0.0987 0.0726 -0.0963 -0.1172 0.1082 0.0464 0.0634 0.1119 -0.0953 -0.0726 -0.1066 -0.0543 0.2620 0.0450 0.1002 0.2769 0.0353 0.1293 0.3377 0.0468 0.0861 0.2341 0.0900 0.0467 -0.4386 -0.4432 -0.4356 -0.4337 0.3532 0.3639 0.3468 0.3646 -0.3131 -0.0447 0.0696
va: 3.3559 2.8786 2.8887 1.8238 1.7471 2.0292 1.8156 1.9111 1.9608 1.8222 3.9113 3.7131 4.0547 3.4807 4.0608 3.6759 0.9919 3.9211 3.9004 0.9641 0.9780 0.9704 0.9733 3.6833 3.5938 3.7711 3.6280 4.4909 1.0048 0.9802 4.4585 0.9907 1.0001 4.3472 1.0062 0.9730 4.5263 0.9845 1.0028 2.0545 2.0576 2.0650 2.0656 0.9256 0.8974 0.9282 0.8882 4.1875 3.2817 0.9933
dispersion: -0.148554287 hartree
energy: -1689.038650196774 hartree
dipole: -2.18244 3.31392 1.13149 15.53185 -15.38072 0.15113 71.49049 -71.61581 -0.12532
magnitude: 1.14839 au
magnitude: 2.91898 debye
