program: Orca
programVersion: 5.0.3
elementType: Y N N O O O O O O O C C C C C C H C C H H H H C C C C C H H C H H C H H C H H O O O O H H H H C N H
elementType: Y
charge: -2
multiplicity: 1
keywords: RKS CAM-B3LYP D3BJ DEF2-TZVP OPT
formula: C17H18N3O11Y
InChI: InChI=1/C17H14N3O9.2H2O.Y/c18-3-10-1-11(4-19(6-13(21)22)7-14(23)24)17(29)12(2-10)5-20(8-15(25)26)9-16(27)28;;;/h1-2H,4-9H2;2*1H2;/q-5;;;+5/rC17H18N3O11Y/c18-3-10-1-11-4-19-6-13(21)27-32(19,25,26,28-14(22)7-19)20(8-15(23)29-32,9-16(24)30-32)5-12(2-10)17(11)31-32/h1-2H,4-9,25-26H2
50 atoms
Y  -6.791189 -6.848315 -8.627077
N  -9.115924 -6.188751 -7.596422
N  -4.537961 -6.872899 -7.334662
O  -8.437636 -8.403886 -8.819001
O  -6.853548 -7.964289 -6.626406
O  -6.615364 -5.124859 -7.684701
O  -5.004776 -6.123399 -9.86874
O  -6.80539 -7.5205 -10.845243
O  -5.864423 -8.954012 -8.886855
O  -8.074239 -5.52846 -10.027544
C  -6.659786 -5.104132 -6.40129
C  -5.463743 -5.279645 -5.68654
C  -5.488712 -5.245627 -4.315942
C  -6.703328 -5.070706 -3.638423
C  -7.903687 -5.021887 -4.363706
C  -7.896067 -5.055515 -5.734377
H  -8.84334 -4.977767 -3.825897
C  -9.095829 -5.071583 -6.628288
C  -4.305742 -5.615918 -6.571472
H  -9.079483 -4.156943 -7.224528
H  -10.023069 -5.062284 -6.038249
H  -3.378489 -5.711118 -5.991193
H  -4.173091 -4.821969 -7.306708
C  -9.991679 -5.799291 -8.707077
C  -9.619434 -7.429672 -7.011905
C  -4.522449 -7.997451 -6.394395
C  -3.466855 -6.999563 -8.32403
C  -9.260267 -5.102505 -9.85001
H  -10.827607 -5.181545 -8.362406
H  -10.417316 -6.699655 -9.149827
C  -9.378212 -8.597842 -7.97686
H  -10.690846 -7.367428 -6.780976
H  -9.068959 -7.650118 -6.100192
C  -5.912019 -8.31831 -5.8466
H  -3.825716 -7.83979 -5.565025
H  -4.202981 -8.892653 -6.926366
C  -3.761572 -6.245867 -9.620833
H  -3.388993 -8.047549 -8.612739
H  -2.493341 -6.688483 -7.928684
O  -9.865521 -4.281754 -10.530859
O  -10.076793 -9.599801 -7.874446
O  -6.003634 -8.926271 -4.788828
O  -2.823854 -5.897937 -10.3281
H  -7.560505 -6.93377 -11.039083
H  -6.468001 -9.333406 -8.22822
H  -6.016238 -6.9746 -11.036364
H  -6.297763 -9.125498 -9.736519
C  -6.724899 -4.979008 -2.220737
N  -6.742781 -4.877511 -1.074151
H  -4.579659 -5.387108 -3.744173
totalener: -1688.89573056 hartree
nucrepener: 3830.15730248 hartree
electener: -5519.05303304 hartree
twoeener: 4487.09938323 hartree
kineticenergy: 1656.81897880 hartree
xcener: -160.672344877178 hartree
dispersion: -0.074111227 hartree
dispersion: -0.074235302 hartree
dispersion: -0.074336175 hartree
dispersion: -0.074350368 hartree
dispersion: -0.074320833 hartree
dispersion: -0.074231254 hartree
dispersion: -0.074169591 hartree
dispersion: -0.074147491 hartree
dispersion: -0.074150238 hartree
dispersion: -0.074152854 hartree
dispersion: -0.074150249 hartree
dispersion: -0.074144566 hartree
dispersion: -0.074143133 hartree
dispersion: -0.074153755 hartree
dispersion: -0.074186817 hartree
dispersion: -0.074249143 hartree
dispersion: -0.074342235 hartree
dispersion: -0.074463814 hartree
dispersion: -0.074598874 hartree
dispersion: -0.074761181 hartree
dispersion: -0.074922453 hartree
dispersion: -0.075076540 hartree
dispersion: -0.075202749 hartree
dispersion: -0.075313112 hartree
dispersion: -0.075424248 hartree
dispersion: -0.075525382 hartree
dispersion: -0.075626437 hartree
dispersion: -0.075729864 hartree
dispersion: -0.075852020 hartree
dispersion: -0.075967953 hartree
dispersion: -0.076113987 hartree
dispersion: -0.076166839 hartree
dispersion: -0.076345234 hartree
dispersion: -0.076333293 hartree
dispersion: -0.076363914 hartree
dispersion: -0.076342580 hartree
dispersion: -0.076342401 hartree
dispersion: -0.076333222 hartree
dispersion: -0.076345802 hartree
dispersion: -0.076353473 hartree
dispersion: -0.076418414 hartree
dispersion: -0.076487937 hartree
dispersion: -0.076602106 hartree
dispersion: -0.076749445 hartree
dispersion: -0.076892870 hartree
dispersion: -0.076998453 hartree
dispersion: -0.077090660 hartree
dispersion: -0.077046507 hartree
dispersion: -0.077168936 hartree
dispersion: -0.077200134 hartree
dispersion: -0.077243491 hartree
dispersion: -0.077249253 hartree
dispersion: -0.077287862 hartree
dispersion: -0.077318941 hartree
dispersion: -0.077376858 hartree
dispersion: -0.077406706 hartree
dispersion: -0.077408576 hartree
dispersion: -0.077379720 hartree
dispersion: -0.077328753 hartree
dispersion: -0.077290488 hartree
dispersion: -0.077266302 hartree
dispersion: -0.077265465 hartree
dispersion: -0.077289193 hartree
dispersion: -0.077328038 hartree
dispersion: -0.077411911 hartree
dispersion: -0.077447361 hartree
dispersion: -0.077500594 hartree
dispersion: -0.077488523 hartree
dispersion: -0.077476887 hartree
dispersion: -0.077510401 hartree
dispersion: -0.077518198 hartree
dispersion: -0.077530269 hartree
dispersion: -0.077539969 hartree
dispersion: -0.077554723 hartree
dispersion: -0.077561132 hartree
dispersion: -0.077578791 hartree
dispersion: -0.077605647 hartree
dispersion: -0.077565775 hartree
dispersion: -0.077606702 hartree
dispersion: -0.077612800 hartree
dispersion: -0.077627481 hartree
dispersion: -0.077637296 hartree
dispersion: -0.077634154 hartree
dispersion: -0.077633631 hartree
dispersion: -0.077638041 hartree
dispersion: -0.077644570 hartree
dispersion: -0.077655610 hartree
dispersion: -0.077670172 hartree
dispersion: -0.077682377 hartree
dispersion: -0.077683829 hartree
dispersion: -0.077686735 hartree
dispersion: -0.077685368 hartree
dispersion: -0.077687194 hartree
dispersion: -0.077690423 hartree
chargesum: -2.0000000
charge: 1.025446 -0.163686 -0.166338 -0.481408 -0.538667 -0.481664 -0.520856 -0.613329 -0.577100 -0.521893 0.263120 -0.048903 -0.257529 0.267472 -0.280045 0.070332 0.094610 -0.131578 -0.152476 0.131124 0.067496 0.085291 0.135353 -0.122696 -0.112847 -0.137511 -0.087021 0.234082 0.065360 0.116922 0.248399 0.057246 0.148758 0.300707 0.066442 0.108629 0.208596 0.106533 0.066088 -0.422771 -0.426380 -0.416267 -0.417099 0.360755 0.372468 0.355541 0.370492 -0.332851 -0.008116 0.091769
charge: -0.229012 0.153233 0.156742 0.040307 0.073417 0.153806 0.054191 -0.142088 -0.103686 0.046801 -0.251427 -0.127692 -0.067356 -0.178397 -0.068614 -0.120680 0.147676 -0.211778 -0.208114 0.158019 0.126661 0.124517 0.159296 -0.240720 -0.254175 -0.246882 -0.251120 -0.611111 0.126200 0.158914 -0.610242 0.121273 0.156467 -0.620885 0.127911 0.145388 -0.611040 0.148415 0.125918 -0.013642 -0.012738 0.001572 -0.009704 0.179283 0.192390 0.174344 0.181931 -0.179695 -0.011524 0.147652
qa: 1.0254 -0.1637 -0.1663 -0.4814 -0.5387 -0.4817 -0.5209 -0.6133 -0.5771 -0.5219 0.2631 -0.0489 -0.2575 0.2675 -0.2800 0.0703 0.0946 -0.1316 -0.1525 0.1311 0.0675 0.0853 0.1354 -0.1227 -0.1128 -0.1375 -0.0870 0.2341 0.0654 0.1169 0.2484 0.0572 0.1488 0.3007 0.0664 0.1086 0.2086 0.1065 0.0661 -0.4228 -0.4264 -0.4163 -0.4171 0.3608 0.3725 0.3555 0.3705 -0.3329 -0.0081 0.0918
va: 3.3525 2.8138 2.8233 1.8120 1.7206 2.0191 1.8032 1.9046 1.9555 1.8124 3.9308 3.6492 4.0475 3.5111 4.0604 3.6340 0.9903 3.8901 3.8849 0.9606 0.9774 0.9692 0.9691 3.6761 3.5801 3.7518 3.6250 4.5329 1.0027 0.9748 4.5074 0.9909 0.9929 4.3975 1.0047 0.9694 4.5657 0.9812 1.0018 2.0761 2.0806 2.0890 2.0878 0.9190 0.8895 0.9208 0.8828 4.2153 3.3028 0.9915
dispersion: -0.077693321 hartree
energy: -1689.172744968736 hartree
dipole: -2.25924 3.41317 1.15393 15.56165 -15.36352 0.19813 71.47944 -71.47860 0.00084
magnitude: 1.17082 au
magnitude: 2.97598 debye
