program: Gaussian 09
title: 000075665
version: EM64L-G09RevD.01
frameworkgroup: C1[X(C15H33O4P)]
method: RPBEPBE
basis: SDD
operation: Freq
keyword: #p
keyword: freq=noraman
keyword: PBEPBE/SDD
title: #p freq=noraman PBEPBE/SDD
converged: YES YES NO NO
title: Mulliken charges:
elementType: P O O O O C C C C C C C C C C C C C C C H H H H H H H H H H H H H H H H H H H H H H H H H H H H H H H H H
charge: 1.402613 -0.524004 -0.524403 -0.494612 -0.619126 -0.368284 -0.368480 -0.370547 -0.344772 -0.344699 -0.347155 -0.277294 -0.277175 -0.269705 -0.349163 -0.349057 -0.348897 -0.691478 -0.691535 -0.691884 0.207455 0.215922 0.216354 0.206922 0.211440 0.212002 0.191483 0.187159 0.186992 0.191698 0.187667 0.187975 0.237155 0.213064 0.212777 0.237027 0.221760 0.223105 0.196157 0.198322 0.198407 0.196073 0.198203 0.197932 0.211226 0.210029 0.217785 0.210033 0.211296 0.217865 0.209952 0.209997 0.218424
chargesum: 0.00000
title: Mulliken charges with hydrogens summed into heavy atoms:
elementType: P O O O O C C C C C C C C C C C C C C C
charge: 1.402613 -0.524004 -0.524403 -0.494612 -0.619126 0.055093 0.054796 0.052895 0.033871 0.033992 0.028486 0.172925 0.172629 0.175160 0.045316 0.045423 0.047237 -0.052438 -0.052341 -0.053512
polarizability: 2.41585576e+02 1.68647780e-01 2.13837072e+02 -6.54279256e-01 -5.89061993e+00 1.73823505e+02
1716.lowfreq: -21.9377 -13.6592 -7.2321 -0.0007 -0.0007 0.0013 5.2559 9.0434 13.0287
frequency: -19.7052 -12.6814 2.8823 18.6297 21.9588 31.9272 55.7705 57.5143 60.9474 72.7710 73.9282 81.9830 88.1901 91.9841 103.5119 127.7279 128.5956 133.9031 149.3048 149.7490 164.1198 180.1635 214.3192 226.4212 230.1130 232.6067 233.6680 259.9244 262.2439 309.2558 352.5746 366.6387 395.2258 397.4794 423.8105 456.9366 475.7800 491.5427 645.3360 729.5435 730.6425 731.3685 732.7648 733.3046 765.8679 767.8208 770.7409 843.0200 846.3974 849.6610 885.6725 888.5241 888.7721 926.0293 935.2015 958.0963 963.9711 967.3697 968.4961 1015.5595 1015.9586 1016.4161 1052.9043 1067.8822 1068.5606 1071.3949 1075.7167 1076.1444 1077.4343 1122.0628 1123.4894 1125.1271 1144.3670 1145.6885 1146.2710 1200.5312 1201.0086 1201.8084 1249.3474 1251.9626 1253.2215 1257.7646 1258.6312 1260.0040 1278.7820 1282.2227 1283.1588 1289.2684 1292.0062 1293.2410 1315.8033 1316.3462 1317.9914 1353.3610 1354.1607 1354.8836 1369.6933 1370.8474 1374.6254 1388.2023 1390.0238 1395.1291 1466.2379 1466.6262 1467.0732 1467.5694 1468.4166 1469.4609 1475.1330 1476.1122 1476.7282 1477.9871 1478.0503 1479.2227 1484.0765 1484.3236 1486.3271 1490.3707 1490.9118 1492.4969 2957.7895 2958.3667 2958.6708 2970.5862 2970.6661 2972.0969 2972.8975 2973.4124 2973.8301 2978.4396 2979.7893 2984.8384 2995.4958 2995.7615 2997.8656 2998.8727 2998.9778 2999.4326 3025.4490 3025.7573 3026.5610 3039.9524 3040.1948 3041.3727 3067.4078 3067.7467 3068.5716 3072.2580 3072.7080 3073.0864 3073.2384 3073.3718 3073.7843
redmass: 1.7334 2.7022 3.9610 2.1609 4.1489 3.7729 1.9543 2.7332 3.2397 3.7045 3.9573 2.9296 1.8718 1.7916 1.7183 2.5134 3.5015 2.3588 3.6583 2.4332 5.6709 4.8438 5.4180 1.2070 2.9569 1.1107 1.1939 5.7281 4.1401 3.6272 4.5654 6.3466 3.9248 3.9222 3.4702 3.8876 4.7790 4.7440 9.1184 6.7316 1.2490 1.2060 2.5106 1.2479 1.1038 1.1029 1.1044 1.1716 1.1729 1.1731 2.2765 2.0846 2.0644 4.8170 5.5609 5.9682 1.1588 1.1675 1.1521 3.9378 3.8833 3.8562 7.4461 2.4822 2.4947 2.7791 2.5581 2.5980 2.6842 2.5212 2.5295 2.6432 1.4114 1.4050 1.4266 1.4602 1.4653 1.4543 1.2815 1.2799 1.2759 1.2414 1.2364 1.2331 1.0811 1.0889 1.0849 1.0973 1.0950 1.0924 1.3397 1.3406 1.3259 1.5743 1.5485 1.5406 1.4165 1.4078 1.3753 1.2205 1.2188 1.2196 1.0737 1.0714 1.0749 1.0751 1.0722 1.0747 1.0583 1.0693 1.0537 1.0631 1.0466 1.0429 1.0757 1.0753 1.0796 1.0916 1.0922 1.0913 1.0586 1.0587 1.0584 1.0589 1.0586 1.0570 1.0372 1.0368 1.0388 1.0578 1.0580 1.0564 1.0599 1.0606 1.0597 1.0978 1.0981 1.0971 1.1027 1.1025 1.1028 1.1046 1.1046 1.1057 1.1042 1.1040 1.1034 1.1033 1.1027 1.1003 1.0997 1.0999 1.1045
irintensity: 0.0670 0.0469 0.0732 0.8286 0.1188 0.7597 1.1475 0.9520 0.5790 0.8394 0.2990 0.0319 0.6124 0.5215 1.0963 0.4174 0.6933 0.0568 1.4005 0.2446 14.8485 2.5775 9.0933 1.1345 7.7157 0.1208 0.8093 0.2739 0.5474 0.0501 26.5452 36.6391 6.4958 9.9762 2.3914 10.9323 8.6043 11.5109 12.0065 170.4646 21.3613 11.7974 159.6729 60.6955 0.8648 0.3230 0.4165 1.0873 1.1669 0.1045 164.3984 23.0728 53.1821 412.6974 202.5581 19.0905 1.5278 2.1828 1.1794 11.3711 13.0052 5.7938 108.4949 19.3479 12.3231 26.9429 1.7155 7.3378 14.1542 9.7608 3.8529 6.8321 0.0126 0.4464 0.7745 0.1699 0.1945 0.5778 8.2083 6.0782 5.8076 0.1263 0.4774 0.3553 0.4083 0.3896 0.9500 0.9531 1.2380 0.9001 0.4753 0.1447 0.4366 1.6798 1.8126 1.7817 13.7063 16.4749 9.8599 14.7108 13.8859 13.2648 0.4620 0.6243 0.0613 0.0141 0.0910 0.3184 9.0391 6.9563 9.3902 0.4117 15.3252 12.5029 1.1889 0.7803 0.4484 15.0256 46.0376 11.2202 5.6584 7.6615 4.3697 32.8059 66.1231 61.6749 35.7022 32.8918 26.4488 35.3742 27.7113 14.6561 24.3747 56.3858 59.2795 3.1584 2.6217 3.8648 17.0550 21.0375 20.9622 1.5523 0.8899 0.5899 0.8199 0.4773 4.1763 3.3371 242.5789 60.8340 46.1420 73.8383 170.0368
temp: 298.150 k
press: 1.00000 atm
elementType: 15 8 8 8 8 6 6 6 6 6 6 6 6 6 6 6 6 6 6 6 1 1 1 1 1 1 1 1 1 1 1 1 1 1 1 1 1 1 1 1 1 1 1 1 1 1 1 1 1 1 1 1 1
symmnumber: 1
zpe: 1215573.9 jmol-1
zpe.correction: 0.462988 hartree
zpe.thermalcorrener: 0.489663 hartree
zpe.thermalcorrenthalpy: 0.490607 hartree
zpe.thermalcorrgfe: 0.399477 hartree
zpe.sumelectzpe: -1231.817628 hartree
zpe.sumelectthermal: -1231.790953 hartree
zpe.sumelectthermalent: -1231.790009 hartree
zpe.sumelectthermalfe: -1231.881139 hartree
dipole: 0.1738 1.3647 -2.7360
dipole: 3.0624
quadrupole: -114.6431 -125.6263 -147.3000
quadrupole: -0.5525 0.3941 2.0856
quadrupole: 14.5467 3.5635 -18.1102 -0.5525 0.3941 2.0856
hfenergy: -1232.2806161 hartree
pointgroup: C01 [X(C15H33O4P1)]
dipole: 0.0431793 -0.6063379 1.0402663 debye
polarizability: 241.5194766|-1.3601235|214.4875511|0.4727873|-3.339008|173.2391251 unknown
InChI: InChI=1S/C15H33O4P/c1-4-7-10-13-17-20(16,18-14-11-8-5-2)19-15-12-9-6-3/h4-15H2,1-3H3
charge 0 multiplicity 1
53 atoms
P  -0.05385 0.470876 -1.091145
O  -1.357862 0.690272 0.021364
O  1.235883 0.74948 0.025328
O  -0.011479 -1.22777 -1.414876
O  -0.073664 1.327856 -2.424904
C  -3.600963 1.356974 0.644122
C  3.472216 1.434525 0.649879
C  0.079556 -3.587956 -0.894631
C  -4.999368 1.840105 0.19036
C  4.863735 1.940316 0.19989
C  0.188741 -4.695428 0.180455
C  -2.672087 1.124646 -0.546859
C  2.540917 1.212245 -0.54121
C  0.041816 -2.191763 -0.272811
C  -5.964199 2.070692 1.376232
C  5.830236 2.160005 1.386475
C  0.20992 -6.115967 -0.429885
C  -7.358497 2.557079 0.926209
C  7.219323 2.66462 0.940463
C  0.338132 -7.223946 0.637356
H  -3.693937 0.417366 1.221765
H  -3.140161 2.105975 1.31583
H  3.005894 2.16669 1.336226
H  3.577474 0.486235 1.21108
H  -0.833526 -3.736931 -1.501884
H  0.940919 -3.647321 -1.58708
H  -4.898512 2.782968 -0.386137
H  -5.446582 1.096639 -0.502116
H  5.316136 1.213543 -0.506834
H  4.751142 2.891848 -0.359911
H  1.110393 -4.543685 0.780148
H  -0.662081 -4.61699 0.889147
H  -2.522851 2.047763 -1.138264
H  -3.061679 0.33185 -1.215857
H  2.939049 0.438717 -1.227775
H  2.37581 2.144454 -1.113747
H  0.947335 -1.986841 0.33015
H  -0.852915 -2.049006 0.363255
H  -6.06655 1.127961 1.951236
H  -5.517631 2.811498 2.07005
H  5.379853 2.886114 2.093254
H  5.941854 1.209177 1.946254
H  -0.715926 -6.272353 -1.019651
H  1.052129 -6.191011 -1.147277
H  -7.285954 3.51292 0.37395
H  -7.839669 1.819125 0.256803
H  -8.028805 2.716332 1.790647
H  7.704987 1.940704 0.259063
H  7.137574 3.627951 0.402728
H  7.890322 2.816488 1.805689
H  1.273191 -7.10968 1.217618
H  -0.506179 -7.187242 1.351501
H  0.347288 -8.22882 0.176831
