program: Gaussian 16
title: Title Card Required
version: EM64L-G16RevC.01
frameworkgroup: C1[X(C20H19N)]
method: UM062X
basis: Gen
operation: Freq
keyword: #p
keyword: freq=noraman
keyword: gen
keyword: integral=grid=ultrafine
keyword: m062x
title: #p freq=noraman gen integral=grid=ultrafine m062x
basis: NPDir=0 NMtPBC= 1 NCelOv= 1 NCel= 1 NClECP= 1 NCelD= 1
basis: NCelK= 1 NCelE2= 1 NClLst= 1 CellRange= 0.0.
basis: One-electron integrals computed using PRISM.
basis: One-electron integral symmetry used in STVInt
basis: NBasis= 765 RedAO= T EigKep= 6.15D-06 NBF= 765
basis: NBsUse= 765 1.00D-06 EigRej= -1.00D+00 NBFU= 765
converged: YES YES YES YES
polarizability: 4.08473996e+02 -2.48331539e+00 2.21527250e+02 9.51847035e-01 -2.25027730e+01 1.82733399e+02
1716.lowfreq: -228.8081 -3.1357 0.0001 0.0003 0.0007 5.2640 7.5830 30.6286 47.4076
frequency: -228.8081 30.4964 47.4035 56.3990 59.7679 67.9666 83.7734 88.0609 107.6957 173.4611 217.8993 233.8107 277.4164 291.4168 332.6572 374.1180 405.5679 406.7301 412.0791 487.0495 491.9558 494.2652 526.4991 539.3281 557.7092 624.0858 626.0040 630.9029 657.8048 688.1881 696.6014 700.4201 709.2670 726.5474 789.4202 791.5649 794.7445 841.1205 843.3567 848.9942 863.2507 864.8467 895.9102 913.1377 935.4788 956.9125 962.1696 989.8136 997.1469 1004.2106 1010.1645 1013.2239 1014.7189 1018.8381 1019.9445 1036.0413 1037.5077 1046.5314 1052.3807 1061.6666 1063.9207 1126.4685 1127.5606 1129.9970 1182.3866 1185.7685 1190.0472 1193.4929 1206.7896 1215.1491 1227.9719 1266.4330 1291.3567 1312.8921 1339.1548 1339.8858 1357.0500 1358.0500 1366.6567 1368.4978 1416.6868 1495.0193 1495.5484 1498.6719 1512.0315 1522.1485 1538.9406 1543.4643 1617.4124 1618.7527 1631.7650 1652.6821 1665.0627 1666.8356 1677.3394 3162.8738 3188.9766 3197.8910 3198.3370 3198.6556 3201.7230 3216.0825 3218.8545 3222.3872 3226.0266 3226.1383 3231.2132 3232.8293 3234.4057 3239.1098 3240.5768 3244.0801 3264.6576 3575.6164
redmass: 8.1065 3.8807 3.8082 4.5483 4.4880 5.5764 4.6214 4.0997 3.9729 4.6571 5.2213 4.2346 4.1385 4.6508 2.6458 2.2274 2.8278 2.8183 2.8379 3.0556 3.6777 2.7917 3.4337 5.8224 6.0547 6.0454 6.3957 6.3105 5.4862 1.4240 1.6649 1.8677 1.4063 1.3649 1.8319 1.8228 1.9105 1.4986 3.5139 3.7893 1.2739 1.2750 2.8608 1.2216 1.4227 1.3558 1.3691 1.3854 1.4951 1.3881 1.5023 2.3627 1.5347 5.2834 5.1065 1.3392 1.3476 1.3501 2.1467 2.2669 2.1182 1.5036 1.5348 1.3939 1.1591 1.1579 1.1559 1.1922 1.1597 1.1798 2.5599 1.9871 2.4531 3.2585 4.4972 5.5105 1.8000 1.4761 1.4644 1.4107 1.6287 1.9993 1.5431 2.2030 2.3322 2.1957 2.2629 2.3225 4.4805 2.8906 5.1916 5.5426 5.8447 5.6261 4.6620 1.0545 1.0895 1.0893 1.0904 1.0893 1.0902 1.0898 1.0879 1.0896 1.0943 1.0913 1.0940 1.0941 1.0983 1.0960 1.0986 1.0934 1.1183 1.0758
irintensity: 246.7028 0.0830 0.2487 0.0600 0.2775 0.4427 0.0163 0.7740 0.1384 0.0970 0.2215 19.7740 8.0425 1.4632 15.1323 4.9329 0.7716 0.8217 0.1769 4.3118 4.0363 1.9501 30.8058 23.8528 19.4792 0.4009 0.3419 0.5329 5.3085 25.8690 53.7154 8.8113 12.5246 140.4763 118.1861 1.7632 11.0536 2.5592 4.5543 0.5867 0.2247 2.0064 26.4480 38.6831 4.0569 0.0871 8.6086 3.7092 28.2488 1.6902 1.0617 0.3356 0.7515 6.8496 0.0164 0.0690 0.2726 0.2921 0.0534 0.1428 0.0520 5.4564 5.3890 5.0384 1.2517 0.2753 0.6142 18.8290 21.7723 16.6643 11.1515 45.9683 51.2682 21.9505 1.0546 9.7432 37.9091 12.7958 15.3563 25.9099 16.7685 12.0305 5.7524 6.4290 19.1240 4.1793 7.1594 6.4424 10.2287 93.7241 51.7708 2.3346 6.6948 48.1432 51.7893 20.0699 3.8630 0.8357 1.0442 0.8474 0.7384 0.9428 1.4237 0.5865 1.0871 5.7730 9.4680 0.1647 0.4191 4.0933 0.0867 6.2925 0.1177 81.7361
temp: 298.150 k
press: 1.00000 atm
elementType: 6 6 6 6 6 6 1 1 1 1 1 7 1 6 6 6 6 6 1 6 1 6 1 1 1 1 6 1 1 6 6 6 6 1 6 1 6 1 1 1
symmnumber: 1
zpe: 881341.4 jmol-1
zpe.correction: 0.335685 hartree
zpe.thermalcorrener: 0.353066 hartree
zpe.thermalcorrenthalpy: 0.354010 hartree
zpe.thermalcorrgfe: 0.288358 hartree
zpe.sumelectzpe: -827.645182 hartree
zpe.sumelectthermal: -827.627802 hartree
zpe.sumelectthermalent: -827.626857 hartree
zpe.sumelectthermalfe: -827.692510 hartree
dipole: 1.3502 -0.6998 0.1445
dipole: 1.5276
quadrupole: -61.0906 -108.0279 -109.3935
quadrupole: 2.2393 2.3402 -13.1308
quadrupole: 31.7467 -15.1906 -16.5562 2.2393 2.3402 -13.1308
hfenergy: -827.9808675 hartree
pointgroup: C01 [X(C20H19N1)]
dipole: -0.5312133 -0.2753359 -0.0568324 debye
polarizability: 408.4739955|2.4833225|221.5272506|0.9518462|22.502773|182.7333988 unknown
InChI: InChI=1/C13H12N.C7H7/c1-3-7-12(8-4-1)11-14-13-9-5-2-6-10-13;1-7-5-3-2-4-6-7/h1-11,14H;2-6H,1H2
charge 1 multiplicity 2
40 atoms
C  2.932265 -2.611479 -0.398028
C  1.585472 -2.357912 -0.585887
C  0.929304 -1.459312 0.252058
C  1.607767 -0.834791 1.29338
C  2.956055 -1.092804 1.466186
C  3.623759 -1.973575 0.623518
H  3.441111 -3.308463 -1.049839
H  1.043676 -2.846446 -1.387694
H  1.108073 -0.152738 1.966477
H  3.487861 -0.605458 2.27231
H  4.676526 -2.171603 0.771609
N  -0.436919 -1.215628 -0.007264
H  -0.857469 -1.835063 -0.689094
C  -1.194697 -0.248217 0.47664
C  -2.631067 -0.19957 0.247968
C  -3.410085 0.531395 1.148273
C  -3.246505 -0.848505 -0.826962
C  -4.784015 0.591836 0.992482
H  -2.935161 1.040181 1.979053
C  -4.618261 -0.781002 -0.98148
H  -2.665956 -1.390581 -1.565064
C  -5.388765 -0.064712 -0.070828
H  -5.382775 1.149599 1.699421
H  -5.091128 -1.282133 -1.814992
H  -6.462099 -0.015412 -0.196249
H  -0.796412 0.299593 1.319465
C  -0.667092 1.634356 -0.777527
H  -1.085982 1.197734 -1.675148
H  -1.322855 2.276676 -0.203675
C  0.734358 1.741781 -0.630887
C  1.605759 1.0644 -1.512532
C  1.295068 2.497891 0.423926
C  2.971684 1.128986 -1.33651
H  1.186666 0.497168 -2.335531
C  2.661234 2.562373 0.589045
H  0.636406 3.039638 1.093093
C  3.502414 1.873379 -0.285139
H  3.631672 0.608271 -2.017321
H  3.083304 3.153715 1.390629
H  4.575056 1.927607 -0.152778
