program: Gaussian 09
title: 000077536
version: EM64L-G09RevD.01
frameworkgroup: C1[X(C3H6Cl2Si)]
method: RPBEPBE
basis: SDD
operation: Freq
keyword: #p
keyword: freq=noraman
keyword: PBEPBE/SDD
title: #p freq=noraman PBEPBE/SDD
converged: YES YES NO NO
title: Mulliken charges:
elementType: Cl Cl Si C C C H H H H H H
charge: -0.291156 -0.280855 0.778006 -0.887881 -0.035221 -0.523368 0.285804 0.295668 -0.027394 0.232261 0.225343 0.228793
chargesum: 0.00000
title: Mulliken charges with hydrogens summed into heavy atoms:
elementType: Cl Cl Si C C C
charge: -0.291156 -0.280855 0.750612 -0.306409 0.197040 -0.069231
polarizability: 9.74464204e+01 1.19829414e+01 7.10344358e+01 3.77104171e-01 -4.89641823e+00 5.18990104e+01
1716.lowfreq: -0.0014 -0.0013 0.0024 1.1848 12.6590 17.7843 48.8920 55.0740 134.8281
frequency: 48.6444 54.9496 134.8240 146.6405 201.2653 246.8528 403.5576 429.8225 485.4274 579.6283 702.5698 739.9575 772.4354 851.3514 927.2504 951.0908 1002.3248 1057.1767 1196.6198 1220.3458 1297.7137 1409.3307 1432.2020 1648.3457 2180.4880 3007.3462 3079.0428 3094.5654 3109.8757 3207.6605
redmass: 3.9125 3.2291 4.1121 8.8005 3.6228 3.8344 1.9027 8.1864 12.7097 1.8241 1.1615 1.7107 1.5282 1.4263 2.1174 1.3407 1.1158 1.3595 1.4417 1.2681 1.2095 1.1062 1.1640 4.4999 1.0434 1.0595 1.0975 1.0640 1.0928 1.1153
irintensity: 1.0934 0.3677 3.6377 4.0862 6.9953 3.8202 5.7513 31.9082 88.9962 37.1337 86.2511 54.1371 59.4296 56.8699 8.0563 77.5506 16.3236 32.6444 11.3859 16.8739 1.4144 12.7219 12.9285 10.7135 76.5819 3.8176 0.9598 8.9857 10.4457 20.7449
temp: 298.150 k
press: 1.00000 atm
elementType: 17 17 14 6 6 6 1 1 1 1 1 1
symmnumber: 1
zpe: 213050.8 jmol-1
zpe.correction: 0.081147 hartree
zpe.thermalcorrener: 0.089585 hartree
zpe.thermalcorrenthalpy: 0.090529 hartree
zpe.thermalcorrgfe: 0.046037 hartree
zpe.sumelectzpe: -1326.992306 hartree
zpe.sumelectthermal: -1326.983868 hartree
zpe.sumelectthermalent: -1326.982923 hartree
zpe.sumelectthermalfe: -1327.027415 hartree
dipole: 2.6526 -1.9412 0.7824
dipole: 3.3789
quadrupole: -61.4928 -61.4439 -56.3578
quadrupole: -0.8641 -0.2517 -1.4444
quadrupole: -1.7280 -1.6791 3.4071 -0.8641 -0.2517 -1.4444
hfenergy: -1327.0734523 hartree
pointgroup: C01 [X(C3H6Cl2Si1)]
dipole: 1.136152 -0.5315274 0.4402221 debye
dipolederiv: -0.852442 -0.197736 -0.0068431 -0.2262183 -0.4805507 -0.0174949 -0.0561277 -0.0459635 -0.3308426 -0.3740439 0.006918 0.0093695 0.1100135 -0.703066 0.1121315 0.0031121 0.1710315 -0.3742957 1.7531543 0.1981534 -0.011925 0.0418189 1.6282469 -0.1009338 -0.0164196 -0.1273431 1.096451 -0.4258354 -0.0872301 -0.0147665 -0.0742795 -0.2447205 -0.0001824 -0.1403496 0.003209 -0.2281387 0.1492125 0.1092752 0.0739547 0.2918758 -0.1173438 -0.098758 0.3853241 -0.0920073 0.0712871 -0.204953 0.1029811 0.1484305 0.0722152 -0.2491971 -0.1067484 0.1064282 -0.0892402 0.0146847 0.0508994 0.0286039 -0.0154621 -0.0571032 -0.0686425 0.0355216 -0.0302821 0.0123878 0.1136576 0.0559243 -0.0086162 0.0429196 -0.0298775 0.1040341 0.0064355 -0.0320029 -0.0042074 -0.0574396 -0.274375 -0.0083159 -0.0260581 0.0471288 -0.2463728 0.0077433 0.0416934 0.0063934 -0.2457076 0.0469989 -0.0417233 -0.0346495 -0.0346396 0.111597 0.0838441 -0.0987379 0.0815243 -0.0755031 -0.0196672 -0.0853726 -0.0859238 -0.1326993 0.1411702 0.0116515 -0.1090583 0.0070222 0.0670292 0.0951271 -0.0169374 -0.079046 -0.0082347 0.1248452 0.06679 -0.0535796 0.0771933 -0.0511822 unknown
polarizability: 93.6861629|15.080073|71.7516774|-1.9538923|-9.0592504|54.9420263 unknown
InChI: InChI=1S/C3H6Cl2Si/c1-2-3-6(4)5/h2,6H,1,3H2
charge 0 multiplicity 1
12 atoms
Cl -2.876522 -1.049839 0.04401
Cl -1.052964 1.964145 -0.511757
Si -1.004912 0.011204 0.478655
C  0.460918 -0.991516 -0.212631
C  1.767535 -0.50455 0.380113
C  2.638359 0.328269 -0.245744
H  0.281322 -2.054995 0.034714
H  0.452947 -0.896106 -1.312681
H  -0.958851 0.261829 1.953528
H  1.998783 -0.854489 1.39674
H  3.563968 0.65264 0.241735
H  2.449917 0.707806 -1.256982
