program: Orca
programVersion: 6.0.0
elementType: C C C C C C H H H H O H C H H C H C O O H H H H N
charge: 1
multiplicity: 1
keywords: wB97X-D3BJ TightOpt Freq def2-TZVPP def2/J RIJCOSX TightSCF defgrid3 CHELPG
frequency: 0.00 0.00 0.00 0.00 0.00 0.00 37.63 47.26 62.44 70.74 168.13 191.43 216.74 287.13 319.71 359.94 392.42 398.05 429.13 434.11 493.65 525.42 556.74 603.13 628.81 656.77 728.80 748.79 792.37 838.15 860.18 871.80 886.73 911.91 946.83 984.44 1011.37 1039.25 1054.20 1075.26 1115.14 1148.60 1198.12 1207.31 1208.01 1245.16 1254.69 1305.44 1336.33 1343.89 1366.28 1371.56 1390.51 1417.13 1494.56 1498.81 1505.23 1580.52 1644.91 1661.23 1671.89 1699.94 1905.89 3084.34 3146.19 3156.73 3178.84 3190.45 3208.87 3234.55 3325.74 3482.46 3540.41 3780.34 3873.75
frequency: 37.63 47.26 62.44 70.74 168.13 191.43 216.74 287.13 319.71 359.94 392.42 398.05 429.13 434.11 493.65 525.42 556.74 603.13 628.81 656.77 728.80 748.79 792.37 838.15 860.18 871.80 886.73 911.91 946.83 984.44 1011.37 1039.25 1054.20 1075.26 1115.14 1148.60 1198.12 1207.31 1208.01 1245.16 1254.69 1305.44 1336.33 1343.89 1366.28 1371.56 1390.51 1417.13 1494.56 1498.81 1505.23 1580.52 1644.91 1661.23 1671.89 1699.94 1905.89 3084.34 3146.19 3156.73 3178.84 3190.45 3208.87 3234.55 3325.74 3482.46 3540.41 3780.34 3873.75
formula: C9H12NO3
InChI: InChI=1/C9H12NO3/c10-8(9(12)13)5-6-1-3-7(11)4-2-6/h1-4,8,11-12H,5H2,10H3
25 atoms
C  2.59618 1.065224 0.498657
C  1.251907 1.272248 0.23312
C  0.53228 0.401673 -0.588669
C  1.201611 -0.686846 -1.14694
C  2.545472 -0.903581 -0.894711
C  3.249529 -0.027617 -0.066696
H  3.158566 1.749302 1.121259
H  0.765541 2.151924 0.646233
H  0.673338 -1.368093 -1.806674
H  3.053658 -1.746959 -1.349693
O  4.559228 -0.17996 0.220237
H  4.928745 -0.933756 -0.247448
C  -0.94663 0.596674 -0.812011
H  -1.239919 1.625373 -0.584356
H  -1.237073 0.398797 -1.844185
C  -1.756144 -0.371476 0.068414
H  -1.556731 -1.400652 -0.22736
C  -3.249716 -0.110692 -0.052544
O  -3.871919 -0.397406 -1.025819
O  -3.737373 0.512891 1.038742
H  -4.677549 0.700708 0.901036
H  -0.264666 -0.128914 1.480453
H  -1.699712 0.610166 1.91569
H  -1.55353 -1.022963 2.073884
N  -1.290739 -0.226488 1.494565
totalener: -630.81701341782730 hartree
nucrepener: 789.98791314683695 hartree
electener: -1420.80492626780779 hartree
oneelecener: -2409.49585827481951 hartree
twoeener: 988.69093200701184 hartree
kineticenergy: 628.30681808927920 hartree
exchangeener: -55.783292622087 hartree
correlationener: -4.057491020509 hartree
xcener: -59.840783642596 hartree
dispersion: -0.051200074 hartree
dispersion: -0.050267833 hartree
dispersion: -0.050565941 hartree
dispersion: -0.050866876 hartree
dispersion: -0.050727546 hartree
dispersion: -0.050679487 hartree
dispersion: -0.050655097 hartree
dispersion: -0.050656311 hartree
dispersion: -0.050662991 hartree
dispersion: -0.050664805 hartree
dispersion: -0.050664683 hartree
dispersion: -0.050663779 hartree
dispersion: -0.050662993 hartree
energy: -528.8543 -527.0519 -526.9009 -400.5055 -287.8427 -286.4343 -284.8793 -284.3517 -283.6462 -283.5200 -283.4603 -283.1873 -283.0544 -38.5427 -36.1553 -35.9804 -35.9076 -31.1082 -29.9447 -28.0614 -27.8152 -26.1455 -25.1388 -24.3258 -23.9307 -23.7908 -23.2115 -22.2557 -21.7126 -20.9544 -20.8243 -20.1622 -19.8283 -19.4696 -18.7300 -18.5976 -18.5858 -18.2021 -17.8850 -17.7008 -16.9383 -16.4592 -16.2748 -15.9082 -15.6164 -15.1231 -13.3531 -12.2303 -2.4180 -2.1550 -1.9429 -1.4285 -0.8784 -0.5136 -0.1439 -0.0251 0.2864 0.6667 0.8389 electronvolt
chargesum: 1.0000000
charge: -0.130110 -0.242071 0.002762 -0.176746 -0.130330 0.197282 0.151421 0.154468 0.145882 0.122405 -0.263510 0.220796 -0.211419 0.138209 0.161382 0.006792 0.169233 0.267442 -0.226046 -0.295793 0.260456 0.244020 0.235232 0.244574 -0.046331
charge: 0.009350 -0.022783 -0.122327 0.000824 -0.001878 -0.188142 0.033630 0.024706 0.030853 0.026019 0.377984 -0.098442 0.009669 0.041437 0.053684 -0.037998 0.049939 -0.439828 0.184813 0.353727 -0.063144 0.050275 0.051758 0.056980 0.618895
qa: -0.1301 -0.2421 0.0028 -0.1767 -0.1303 0.1973 0.1514 0.1545 0.1459 0.1224 -0.2635 0.2208 -0.2114 0.1382 0.1614 0.0068 0.1692 0.2674 -0.2260 -0.2958 0.2605 0.2440 0.2352 0.2446 -0.0463
va: 4.0075 3.9698 3.5356 4.0586 3.9415 4.1021 1.0063 0.9988 1.0031 1.0062 2.2405 1.0234 3.8756 1.0040 1.0095 3.7526 1.0000 4.3788 2.2793 2.1804 1.0038 0.9970 0.9911 0.9684 3.6379
dispersion: -0.050663097 hartree
energy: -630.872280491287 hartree
dipole: 0.361823641 -1.707530662 -1.345707021 -0.106412168 -0.482044458 -0.588456626 2.359625287 -0.413313484 1.946311804
dipolemethod: SCF
magnitude: 2.438306425 au
magnitude: 6.197682395 debye
temp: 298.15 k
press: 1.00 atm
zeropoint: 0.21051011 hartree
thermalvibcorrection: 0.00944613 hartree
thermalrotcorrection: 0.00141627 hartree
thermaltrasncorrection: 0.00141627 hartree
thermaltotal: -630.64949171 hartree
thermalcorr: 0.01227867 hartree
nonthermalcorr: 0.21051011 hartree
totalcorr: 0.22278878 hartree
thermalcorrenthalpy: 0.00094421 hartree
totalenthalpy: -630.64854750 hartree
vibrat: 0.01625263 hartree
rotat: 0.01494583 hartree
transl: 0.01972090 hartree
total: 0.05091936 hartree
totalentropycorr: -0.05091936 hartree
gibbsenthalpy: -630.69946686 hartree
gibbsminuselec: 0.17281363 hartree
