program: Orca
programVersion: 6.0.0
elementType: C C C C C C H H H H O H C H H C H C O H H H N O H
charge: 1
multiplicity: 1
keywords: wB97X-D3BJ TightOpt Freq def2-TZVPP def2/J RIJCOSX TightSCF defgrid3 CHELPG
frequency: 0.00 0.00 0.00 0.00 0.00 0.00 37.83 47.68 80.58 91.27 179.69 209.41 213.99 312.69 346.62 369.11 393.06 424.07 430.78 434.52 509.12 516.52 544.73 583.14 637.98 657.08 730.98 742.90 770.36 842.57 858.23 872.55 891.23 908.05 953.68 979.83 1026.94 1034.83 1040.25 1098.34 1112.60 1146.88 1190.91 1195.65 1209.17 1226.97 1248.30 1316.61 1335.73 1348.31 1357.02 1373.34 1388.34 1424.98 1491.01 1497.99 1507.49 1580.71 1636.19 1662.62 1669.90 1700.30 1903.60 3096.62 3125.77 3158.27 3174.71 3207.21 3211.32 3234.84 3303.67 3478.42 3543.92 3783.43 3874.61
frequency: 37.83 47.68 80.58 91.27 179.69 209.41 213.99 312.69 346.62 369.11 393.06 424.07 430.78 434.52 509.12 516.52 544.73 583.14 637.98 657.08 730.98 742.90 770.36 842.57 858.23 872.55 891.23 908.05 953.68 979.83 1026.94 1034.83 1040.25 1098.34 1112.60 1146.88 1190.91 1195.65 1209.17 1226.97 1248.30 1316.61 1335.73 1348.31 1357.02 1373.34 1388.34 1424.98 1491.01 1497.99 1507.49 1580.71 1636.19 1662.62 1669.90 1700.30 1903.60 3096.62 3125.77 3158.27 3174.71 3207.21 3211.32 3234.84 3303.67 3478.42 3543.92 3783.43 3874.61
formula: C9H12NO3
InChI: InChI=1/C9H12NO3/c10-8(9(12)13)5-6-1-3-7(11)4-2-6/h1-4,8,11-12H,5H2,10H3
25 atoms
C  1.606726 -2.013986 0.618516
C  0.402584 -1.739725 -0.019302
C  0.208848 -0.552297 -0.723331
C  1.267346 0.361112 -0.784834
C  2.469073 0.10066 -0.15698
C  2.644981 -1.089751 0.5527
H  1.74206 -2.9524 1.145144
H  -0.382701 -2.490937 0.00279
H  1.156531 1.277154 -1.354201
H  3.294991 0.798088 -0.217144
O  3.844598 -1.282086 1.140361
H  3.888026 -2.145159 1.560539
C  -1.12732 -0.243103 -1.35531
H  -1.01667 0.267977 -2.311558
H  -1.688325 -1.161989 -1.53915
C  -1.965441 0.679378 -0.457748
H  -3.000722 0.73524 -0.799797
C  -1.429259 2.110711 -0.440545
O  -1.386083 2.616165 0.80656
H  -1.078535 3.533513 0.766164
H  -1.042814 -0.252596 1.140308
H  -2.200803 0.850486 1.627111
N  -1.984146 0.122825 0.943642
O  -1.128774 2.695904 -1.432753
H  -2.652355 -0.641679 1.032344
totalener: -630.81642755492828 hartree
nucrepener: 817.58428821029452 hartree
electener: -1448.40071017712216 hartree
oneelecener: -2464.73528679733772 hartree
twoeener: 1016.33457662021556 hartree
kineticenergy: 628.31075775110651 hartree
exchangeener: -55.784619802341 hartree
correlationener: -4.059334169698 hartree
xcener: -59.843953972039 hartree
dispersion: -0.052655609 hartree
dispersion: -0.051535296 hartree
dispersion: -0.051762583 hartree
dispersion: -0.051983631 hartree
dispersion: -0.052066348 hartree
dispersion: -0.051907239 hartree
dispersion: -0.051908453 hartree
dispersion: -0.051906203 hartree
dispersion: -0.051914998 hartree
dispersion: -0.051919819 hartree
dispersion: -0.051921974 hartree
dispersion: -0.051922977 hartree
dispersion: -0.051924182 hartree
energy: -528.9018 -527.0960 -526.8744 -400.4581 -287.9029 -286.4743 -284.8404 -284.2350 -283.6018 -283.5439 -283.3027 -283.1686 -282.9743 -38.6121 -36.1797 -35.9786 -35.8778 -31.0453 -29.8882 -28.0238 -27.7440 -26.3316 -24.8716 -24.2014 -24.0117 -23.8118 -23.1384 -22.3610 -21.6835 -20.9254 -20.8477 -20.3022 -19.8017 -19.2097 -18.8648 -18.6265 -18.4250 -18.1318 -17.8735 -17.7485 -16.7640 -16.5412 -16.1964 -15.8768 -15.5526 -15.1869 -13.2909 -12.2097 -2.4882 -2.2504 -1.7495 -1.4519 -0.8441 -0.4937 0.0633 0.2559 0.2991 0.3857 0.9634 electronvolt
chargesum: 1.0000000
charge: -0.118200 -0.289244 0.015633 -0.171743 -0.120277 0.185292 0.123461 0.154260 0.163109 0.150554 -0.262708 0.219302 -0.195639 0.161995 0.139438 0.002100 0.159841 0.270962 -0.290736 0.258502 0.244739 0.237590 -0.044260 -0.230648 0.236678
charge: -0.014336 -0.026383 -0.119118 0.005461 0.019786 -0.188182 0.023743 0.023190 0.032990 0.035137 0.377968 -0.099214 0.008502 0.053792 0.038406 -0.031780 0.048278 -0.436072 0.361134 -0.062590 0.050933 0.042080 0.618498 0.182655 0.055122
qa: -0.1182 -0.2892 0.0156 -0.1717 -0.1203 0.1853 0.1235 0.1543 0.1631 0.1506 -0.2627 0.2193 -0.1956 0.1620 0.1394 0.0021 0.1598 0.2710 -0.2907 0.2585 0.2447 0.2376 -0.0443 -0.2306 0.2367
va: 3.9503 4.0063 3.5612 4.0371 3.9829 4.1202 1.0052 1.0006 1.0031 1.0073 2.2414 1.0243 3.8753 1.0091 1.0025 3.8139 0.9994 4.3721 2.1846 1.0045 1.0025 0.9911 3.6265 2.2680 0.9725
dispersion: -0.051924179 hartree
energy: -630.872944007572 hartree
dipole: -5.236855796 2.285956351 -2.950899445 -4.179582852 3.546115170 -0.633467682 1.666080760 0.125968650 1.792049410
dipolemethod: SCF
magnitude: 3.510061243 au
magnitude: 8.921866647 debye
temp: 298.15 k
press: 1.00 atm
zeropoint: 0.21070321 hartree
thermalvibcorrection: 0.00924048 hartree
thermalrotcorrection: 0.00141627 hartree
thermaltrasncorrection: 0.00141627 hartree
thermaltotal: -630.65016778 hartree
thermalcorr: 0.01207302 hartree
nonthermalcorr: 0.21070321 hartree
totalcorr: 0.22277622 hartree
thermalcorrenthalpy: 0.00094421 hartree
totalenthalpy: -630.64922357 hartree
vibrat: 0.01580316 hartree
rotat: 0.01487812 hartree
transl: 0.01972090 hartree
total: 0.05040219 hartree
totalentropycorr: -0.05040219 hartree
gibbsenthalpy: -630.69962576 hartree
gibbsminuselec: 0.17331824 hartree
