program: Orca
programVersion: 6.0.0
elementType: C C C C C C H H H H O H C O O H C H C H H
charge: 1
multiplicity: 1
keywords: wB97X-D3BJ TightOpt Freq def2-TZVPP def2/J RIJCOSX TightSCF defgrid3 CHELPG
frequency: 0.00 0.00 0.00 0.00 0.00 0.00 34.21 40.80 75.03 106.33 189.80 237.00 278.56 320.84 355.41 400.18 464.61 477.95 507.17 525.86 584.17 609.56 673.33 698.64 754.89 765.98 821.83 861.27 888.82 927.44 968.38 984.04 1021.79 1045.13 1048.58 1097.02 1174.92 1182.33 1199.29 1200.66 1226.96 1263.67 1344.77 1358.18 1382.16 1394.57 1422.27 1445.11 1455.30 1559.97 1680.64 1754.25 1825.16 1881.95 3041.42 3060.71 3116.46 3126.71 3185.79 3188.46 3202.93 3232.79 3679.76
frequency: 34.21 40.80 75.03 106.33 189.80 237.00 278.56 320.84 355.41 400.18 464.61 477.95 507.17 525.86 584.17 609.56 673.33 698.64 754.89 765.98 821.83 861.27 888.82 927.44 968.38 984.04 1021.79 1045.13 1048.58 1097.02 1174.92 1182.33 1199.29 1200.66 1226.96 1263.67 1344.77 1358.18 1382.16 1394.57 1422.27 1445.11 1455.30 1559.97 1680.64 1754.25 1825.16 1881.95 3041.42 3060.71 3116.46 3126.71 3185.79 3188.46 3202.93 3232.79 3679.76
formula: C9H9O3
InChI: InChI=1/C9H9O3/c10-7-3-1-6(2-4-7)5-8-9(11)12-8/h1-3,8,11H,4-5H2
21 atoms
C  1.797325 -1.007144 -1.062987
C  0.445732 -0.386849 -1.193158
C  0.052048 0.616222 -0.401804
C  0.950249 1.14363 0.636168
C  2.121683 0.564887 0.919641
C  2.540194 -0.673065 0.218555
H  2.425692 -0.641381 -1.887693
H  -0.202236 -0.754788 -1.983607
H  0.634971 2.025788 1.185414
H  2.77408 0.931486 1.702592
O  3.427602 -1.374965 0.638989
H  1.764715 -2.091563 -1.184142
C  -2.00762 -0.481181 1.234712
O  -1.769334 0.47809 1.991068
O  -1.945487 -1.740072 1.31238
H  -1.615257 -2.058077 2.174571
C  -2.309359 0.662103 0.437086
H  -3.32875 1.035231 0.479231
C  -1.323014 1.22523 -0.528758
H  -1.761614 1.014731 -1.512673
H  -1.31999 2.31349 -0.421807
totalener: -574.02155986028799 hartree
nucrepener: 673.41941801602013 hartree
electener: -1247.44097711478025 hartree
oneelecener: -2100.02632527010155 hartree
twoeener: 852.58534815532141 hartree
kineticenergy: 571.79884330430082 hartree
exchangeener: -50.620882694580 hartree
correlationener: -3.645048364789 hartree
xcener: -54.265931059368 hartree
dispersion: -0.042530269 hartree
dispersion: -0.041813552 hartree
dispersion: -0.041601352 hartree
dispersion: -0.041373341 hartree
dispersion: -0.041511842 hartree
dispersion: -0.041646071 hartree
dispersion: -0.041529045 hartree
dispersion: -0.041364466 hartree
dispersion: -0.041278674 hartree
dispersion: -0.041359350 hartree
dispersion: -0.041630335 hartree
dispersion: -0.041913282 hartree
dispersion: -0.042286140 hartree
dispersion: -0.042488841 hartree
dispersion: -0.042247009 hartree
dispersion: -0.042129490 hartree
dispersion: -0.041950273 hartree
dispersion: -0.041995987 hartree
dispersion: -0.042012707 hartree
dispersion: -0.042034488 hartree
dispersion: -0.042063069 hartree
dispersion: -0.042102760 hartree
dispersion: -0.042126078 hartree
dispersion: -0.042135166 hartree
dispersion: -0.042137707 hartree
energy: -531.7124 -531.1916 -525.5728 -290.7894 -288.4632 -285.2654 -285.1756 -284.2751 -284.0811 -283.8848 -283.3456 -283.3174 -41.9265 -40.1549 -35.1390 -31.7190 -30.4166 -28.5625 -28.2104 -27.5763 -26.2616 -24.5397 -24.2936 -23.8830 -23.0691 -22.5633 -20.9500 -20.8005 -20.5759 -19.9671 -19.6230 -19.3208 -19.0897 -18.7161 -18.4533 -18.0177 -17.7367 -16.7819 -16.5541 -16.1398 -15.6505 -12.9592 -12.7759 -4.4628 -4.0118 -3.3188 -2.2476 -1.4298 -0.7036 -0.3128 0.0817 0.2088 0.7006 0.9719 electronvolt
chargesum: 1.0000000
charge: -0.076428 -0.130256 -0.048753 -0.148234 -0.116586 0.130130 0.131755 0.136465 0.140968 0.155929 -0.249668 0.126022 0.443283 -0.108662 -0.121951 0.294887 0.051493 0.193193 -0.102613 0.147278 0.151750
charge: 0.004101 0.043857 -0.113268 0.006669 0.024333 -0.267331 0.062331 0.026814 0.029642 0.035475 0.167363 0.047846 -0.303009 0.384529 0.522481 -0.009979 0.139048 0.058103 0.011728 0.070973 0.058293
qa: -0.0764 -0.1303 -0.0488 -0.1482 -0.1166 0.1301 0.1318 0.1365 0.1410 0.1559 -0.2497 0.1260 0.4433 -0.1087 -0.1220 0.2949 0.0515 0.1932 -0.1026 0.1473 0.1518
va: 3.8057 3.9262 3.5218 3.9098 3.8363 4.1850 1.0079 0.9979 1.0034 1.0032 2.2246 1.0240 4.0901 2.3911 2.4522 0.9694 3.8280 0.9832 3.8672 1.0020 0.9985
dispersion: -0.042138887 hartree
energy: -574.108590676108 hartree
dipole: -1.724525733 -2.284840909 -4.009366642 2.675316770 -2.276511085 0.398805685 -4.626829977 4.753916044 0.127086066
dipolemethod: SCF
magnitude: 4.031155878 au
magnitude: 10.246383948 debye
temp: 298.15 k
press: 1.00 atm
zeropoint: 0.16482956 hartree
thermalvibcorrection: 0.00807890 hartree
thermalrotcorrection: 0.00141627 hartree
thermaltrasncorrection: 0.00141627 hartree
thermaltotal: -573.93284968 hartree
thermalcorr: 0.01091144 hartree
nonthermalcorr: 0.16482956 hartree
totalcorr: 0.17574100 hartree
thermalcorrenthalpy: 0.00094421 hartree
totalenthalpy: -573.93190547 hartree
vibrat: 0.01400852 hartree
rotat: 0.01456002 hartree
transl: 0.01958192 hartree
total: 0.04815046 hartree
totalentropycorr: -0.04815046 hartree
gibbsenthalpy: -573.98005592 hartree
gibbsminuselec: 0.12853475 hartree
