program: Orca
programVersion: 6.0.0
elementType: C C C C C C H H H H O H C O O H C H C H H
charge: 1
multiplicity: 1
keywords: wB97X-D3BJ TightOpt Freq def2-TZVPP def2/J RIJCOSX TightSCF defgrid3 CHELPG
frequency: 0.00 0.00 0.00 0.00 0.00 0.00 35.18 60.45 62.01 101.33 196.20 247.44 281.68 328.33 387.42 438.96 460.40 466.19 515.36 549.90 595.04 609.83 626.75 704.34 759.94 774.93 825.24 865.99 879.87 944.07 968.23 989.03 1007.01 1047.66 1050.71 1134.38 1169.41 1184.95 1193.27 1198.75 1219.60 1260.32 1337.73 1356.06 1374.04 1384.13 1422.97 1447.64 1454.17 1529.73 1678.96 1757.53 1831.00 1888.15 3040.04 3080.16 3130.12 3132.10 3162.71 3197.04 3209.20 3225.52 3686.26
frequency: 35.18 60.45 62.01 101.33 196.20 247.44 281.68 328.33 387.42 438.96 460.40 466.19 515.36 549.90 595.04 609.83 626.75 704.34 759.94 774.93 825.24 865.99 879.87 944.07 968.23 989.03 1007.01 1047.66 1050.71 1134.38 1169.41 1184.95 1193.27 1198.75 1219.60 1260.32 1337.73 1356.06 1374.04 1384.13 1422.97 1447.64 1454.17 1529.73 1678.96 1757.53 1831.00 1888.15 3040.04 3080.16 3130.12 3132.10 3162.71 3197.04 3209.20 3225.52 3686.26
formula: C9H9O3
InChI: InChI=1/C9H9O3/c10-7-3-1-6(2-4-7)5-8-9(11)12-8/h1-3,8,11H,4-5H2
21 atoms
C  2.31011 -0.024331 0.795795
C  1.052454 0.743796 1.045497
C  0.103733 0.862591 0.112568
C  0.272747 0.22295 -1.20408
C  1.275119 -0.626929 -1.457548
C  2.252944 -0.970529 -0.388978
H  2.630892 -0.578986 1.679171
H  0.936176 1.221986 2.01309
H  -0.442027 0.466779 -1.987685
H  1.400275 -1.114878 -2.417125
O  2.960471 -1.943043 -0.474308
H  3.120125 0.688959 0.585363
C  -1.941874 -0.858878 0.737336
O  -2.246638 -0.376125 1.845537
O  -1.514884 -1.99895 0.409967
H  -1.225728 -2.039659 -0.520655
C  -2.303823 0.51001 0.510422
H  -3.343164 0.728028 0.286276
C  -1.218987 1.53976 0.368663
H  -1.514333 2.194172 -0.457479
H  -1.211959 2.155082 1.271952
totalener: -574.05405359486531 hartree
nucrepener: 682.75849676035216 hartree
electener: -1256.81254953627013 hartree
oneelecener: -2118.98831577218380 hartree
twoeener: 862.17576623591367 hartree
kineticenergy: 571.84801057722814 hartree
exchangeener: -50.627762880125 hartree
correlationener: -3.641277217009 hartree
xcener: -54.269040097134 hartree
dispersion: -0.043240551 hartree
dispersion: -0.041996544 hartree
dispersion: -0.041928977 hartree
dispersion: -0.042029139 hartree
dispersion: -0.042155710 hartree
dispersion: -0.042347724 hartree
dispersion: -0.042760209 hartree
dispersion: -0.043018381 hartree
dispersion: -0.043227416 hartree
dispersion: -0.043302747 hartree
dispersion: -0.043351951 hartree
dispersion: -0.043392935 hartree
dispersion: -0.043381508 hartree
dispersion: -0.043385105 hartree
dispersion: -0.043402999 hartree
dispersion: -0.043418295 hartree
dispersion: -0.043424226 hartree
dispersion: -0.043426628 hartree
energy: -531.6405 -531.2359 -525.9801 -290.7698 -288.3506 -285.5595 -285.2466 -284.4583 -284.4062 -284.2926 -283.8922 -283.5882 -41.9783 -40.2475 -35.5435 -31.8525 -30.4472 -28.6376 -28.1828 -27.8554 -26.6000 -24.6492 -24.5237 -23.4433 -23.2003 -22.7182 -21.5426 -20.9923 -20.5855 -20.1551 -19.9907 -19.4316 -19.0755 -18.8774 -18.6763 -18.1678 -17.9486 -17.0559 -16.8990 -16.4322 -15.9681 -13.3851 -13.1462 -4.5062 -3.9065 -3.2562 -2.2024 -1.6512 -0.6980 -0.3852 -0.1773 0.1728 0.3293 0.8269 electronvolt
chargesum: 1.0000000
charge: -0.080521 -0.083816 -0.019495 -0.337401 -0.101323 0.136895 0.133740 0.143550 0.169028 0.176362 -0.237248 0.134108 0.443905 -0.086728 -0.106669 0.299186 0.030928 0.191728 -0.111975 0.151934 0.153813
charge: 0.007889 0.054394 -0.120302 -0.009254 0.018228 -0.267557 0.050784 0.031429 0.029971 0.035798 0.177849 0.063421 -0.287365 0.415632 0.536947 -0.019097 0.096470 0.051984 0.012433 0.058367 0.061976
qa: -0.0805 -0.0838 -0.0195 -0.3374 -0.1013 0.1369 0.1337 0.1436 0.1690 0.1764 -0.2372 0.1341 0.4439 -0.0867 -0.1067 0.2992 0.0309 0.1917 -0.1120 0.1519 0.1538
va: 3.8136 3.9426 3.4725 3.8591 3.7599 4.1694 1.0214 0.9985 0.9947 0.9953 2.2301 1.0060 4.0877 2.4153 2.4343 0.9713 3.8169 0.9846 3.8308 0.9978 1.0072
dispersion: -0.043424825 hartree
energy: -574.108261904951 hartree
dipole: -0.155307938 -2.938332596 -3.093640534 5.921887240 -4.698821533 1.223065707 -1.357451271 1.174735424 -0.182715848
dipolemethod: SCF
magnitude: 3.331649225 au
magnitude: 8.468379337 debye
temp: 298.15 k
press: 1.00 atm
zeropoint: 0.16508841 hartree
thermalvibcorrection: 0.00796102 hartree
thermalrotcorrection: 0.00141627 hartree
thermaltrasncorrection: 0.00141627 hartree
thermaltotal: -573.93237994 hartree
thermalcorr: 0.01079356 hartree
nonthermalcorr: 0.16508841 hartree
totalcorr: 0.17588197 hartree
thermalcorrenthalpy: 0.00094421 hartree
totalenthalpy: -573.93143573 hartree
vibrat: 0.01370741 hartree
rotat: 0.01449042 hartree
transl: 0.01958192 hartree
total: 0.04777975 hartree
totalentropycorr: -0.04777975 hartree
gibbsenthalpy: -573.97921547 hartree
gibbsminuselec: 0.12904643 hartree
