program: Orca
programVersion: 6.0.0
elementType: C C C C C C H H H H O H C O O H C H C H H
charge: 1
multiplicity: 1
keywords: wB97X-D3BJ TightOpt Freq def2-TZVPP def2/J RIJCOSX TightSCF defgrid3 CHELPG
frequency: 0.00 0.00 0.00 0.00 0.00 0.00 31.05 40.64 74.57 104.86 193.36 244.20 280.13 320.72 378.54 423.06 464.63 476.59 509.96 554.78 592.09 613.35 630.91 698.35 755.78 764.32 822.34 862.40 897.68 925.03 966.28 982.16 1026.54 1047.18 1049.46 1113.30 1175.54 1176.49 1199.55 1200.77 1227.16 1263.53 1344.27 1358.42 1383.16 1391.57 1422.87 1450.47 1454.74 1540.67 1680.96 1753.66 1825.88 1885.11 3042.31 3070.12 3116.98 3123.01 3178.37 3190.06 3199.44 3233.69 3749.03
frequency: 31.05 40.64 74.57 104.86 193.36 244.20 280.13 320.72 378.54 423.06 464.63 476.59 509.96 554.78 592.09 613.35 630.91 698.35 755.78 764.32 822.34 862.40 897.68 925.03 966.28 982.16 1026.54 1047.18 1049.46 1113.30 1175.54 1176.49 1199.55 1200.77 1227.16 1263.53 1344.27 1358.42 1383.16 1391.57 1422.87 1450.47 1454.74 1540.67 1680.96 1753.66 1825.88 1885.11 3042.31 3070.12 3116.98 3123.01 3178.37 3190.06 3199.44 3233.69 3749.03
formula: C9H9O3
InChI: InChI=1/C9H9O3/c10-7-3-1-6(2-4-7)5-8-9(11)12-8/h1-3,8,11H,4-5H2
21 atoms
C  2.272944 0.651552 -0.350221
C  0.956987 1.124817 0.172895
C  0.120416 0.307481 0.821928
C  0.474024 -1.104007 1.036459
C  1.5642 -1.651908 0.490344
C  2.447391 -0.856852 -0.396934
H  3.063471 1.032588 0.311857
H  0.71842 2.178676 0.055673
H  -0.184097 -1.707823 1.653865
H  1.813556 -2.69765 0.62152
O  3.269812 -1.376215 -1.110791
H  2.499399 1.065502 -1.334828
C  -2.142024 -0.120924 -0.849599
O  -2.427967 -1.05599 -0.078985
O  -1.860036 -0.121648 -2.080499
H  -1.651257 0.759932 -2.431889
C  -2.353467 0.465819 0.441623
H  -3.359422 0.804781 0.672429
C  -1.208418 0.798941 1.343222
H  -1.221996 1.891754 1.425504
H  -1.440307 0.412978 2.340204
totalener: -574.05789280457338 hartree
nucrepener: 679.97216642816409 hartree
electener: -1254.03005992665476 hartree
oneelecener: -2113.40925239955959 hartree
twoeener: 859.37919247290495 hartree
kineticenergy: 571.84995425899012 hartree
exchangeener: -50.628122867907 hartree
correlationener: -3.639948899267 hartree
xcener: -54.268071767174 hartree
dispersion: -0.042563934 hartree
dispersion: -0.042115034 hartree
dispersion: -0.042057073 hartree
dispersion: -0.042095982 hartree
dispersion: -0.042119301 hartree
dispersion: -0.042160513 hartree
dispersion: -0.042199618 hartree
dispersion: -0.042201984 hartree
dispersion: -0.042189516 hartree
dispersion: -0.042181674 hartree
dispersion: -0.042178093 hartree
dispersion: -0.042180870 hartree
dispersion: -0.042184920 hartree
dispersion: -0.042190215 hartree
dispersion: -0.042193111 hartree
dispersion: -0.042194529 hartree
energy: -531.7991 -531.2860 -525.5831 -290.8559 -288.4478 -285.2626 -285.1932 -284.3618 -284.1559 -283.8945 -283.4059 -283.3479 -42.0659 -40.3433 -35.1548 -31.6949 -30.3669 -28.2772 -28.1713 -28.0500 -26.4981 -24.5959 -24.2624 -23.4729 -23.0472 -22.7560 -21.5221 -20.7477 -20.6202 -20.1632 -19.6617 -19.2287 -19.1421 -18.6851 -18.4731 -17.9885 -17.7361 -16.8029 -16.5791 -16.1834 -15.6958 -12.9824 -12.8120 -4.5451 -3.7041 -3.2179 -2.6109 -1.4841 -0.6287 -0.4851 0.0341 0.2794 0.5071 0.8612 electronvolt
chargesum: 1.0000000
charge: -0.074881 -0.187098 -0.035225 -0.137377 -0.112777 0.137842 0.132738 0.141750 0.141694 0.156575 -0.247592 0.122399 0.443824 -0.087011 -0.100475 0.293687 0.017025 0.189348 -0.090324 0.142050 0.153827
charge: 0.002711 0.032821 -0.111348 0.006709 0.029656 -0.265949 0.062265 0.024175 0.029718 0.036640 0.170450 0.046658 -0.284882 0.417775 0.536995 -0.017364 0.095622 0.054475 0.008744 0.065477 0.058653
qa: -0.0749 -0.1871 -0.0352 -0.1374 -0.1128 0.1378 0.1327 0.1418 0.1417 0.1566 -0.2476 0.1224 0.4438 -0.0870 -0.1005 0.2937 0.0170 0.1893 -0.0903 0.1421 0.1538
va: 3.8060 3.9348 3.4971 3.9168 3.8473 4.1823 1.0084 0.9951 1.0026 1.0029 2.2268 1.0261 4.0699 2.4112 2.4382 0.9667 3.8824 0.9832 3.8198 1.0037 0.9990
dispersion: -0.042193592 hartree
energy: -574.106326857395 hartree
dipole: -0.283161107 -3.403356471 -3.686517578 5.615360433 -3.263553825 2.351806608 3.905599148 -3.782713911 0.122885237
dipolemethod: SCF
magnitude: 4.374529341 au
magnitude: 11.119169931 debye
temp: 298.15 k
press: 1.00 atm
zeropoint: 0.16512640 hartree
thermalvibcorrection: 0.00801628 hartree
thermalrotcorrection: 0.00141627 hartree
thermaltrasncorrection: 0.00141627 hartree
thermaltotal: -573.93035164 hartree
thermalcorr: 0.01084882 hartree
nonthermalcorr: 0.16512640 hartree
totalcorr: 0.17597522 hartree
thermalcorrenthalpy: 0.00094421 hartree
totalenthalpy: -573.92940743 hartree
vibrat: 0.01391517 hartree
rotat: 0.01456101 hartree
transl: 0.01958192 hartree
total: 0.04805810 hartree
totalentropycorr: -0.04805810 hartree
gibbsenthalpy: -573.97746553 hartree
gibbsminuselec: 0.12886133 hartree
