program: Orca
programVersion: 6.0.0
elementType: C C C C C C H H H H O H C H C O O H C H H
charge: 1
multiplicity: 1
keywords: wB97X-D3BJ TightOpt Freq def2-TZVPP def2/J RIJCOSX TightSCF defgrid3 CHELPG
frequency: 0.00 0.00 0.00 0.00 0.00 0.00 36.49 49.16 82.39 131.58 191.01 251.38 322.69 327.38 419.51 434.44 481.81 523.28 525.55 568.74 593.18 633.32 651.95 726.26 762.55 770.80 821.89 853.39 856.99 884.07 958.72 1009.26 1013.90 1027.49 1039.58 1101.55 1153.40 1192.81 1205.27 1209.53 1215.53 1294.05 1311.25 1376.45 1402.33 1407.60 1457.65 1494.58 1526.31 1539.01 1613.94 1668.15 1698.13 1854.58 3091.34 3178.24 3194.86 3212.66 3227.44 3242.66 3263.86 3783.87 3812.94
frequency: 36.49 49.16 82.39 131.58 191.01 251.38 322.69 327.38 419.51 434.44 481.81 523.28 525.55 568.74 593.18 633.32 651.95 726.26 762.55 770.80 821.89 853.39 856.99 884.07 958.72 1009.26 1013.90 1027.49 1039.58 1101.55 1153.40 1192.81 1205.27 1209.53 1215.53 1294.05 1311.25 1376.45 1402.33 1407.60 1457.65 1494.58 1526.31 1539.01 1613.94 1668.15 1698.13 1854.58 3091.34 3178.24 3194.86 3212.66 3227.44 3242.66 3263.86 3783.87 3812.94
formula: C9H9O3
InChI: InChI=1/C9H9O3/c10-8-4-1-7(2-5-8)3-6-9(11)12/h1-5,10-11H,6H2
21 atoms
C  -2.443555 -1.274323 -0.370415
C  -1.266939 -1.448303 0.279883
C  -0.136591 -0.594234 0.02132
C  -0.279367 0.443196 -0.968532
C  -1.452046 0.62102 -1.622567
C  -2.546263 -0.23134 -1.32702
H  -3.298334 -1.910602 -0.172492
H  -1.164322 -2.235467 1.018087
H  0.557232 1.09192 -1.184504
H  -1.589381 1.394394 -2.366484
O  -3.653605 -0.004172 -1.992319
H  -4.362951 -0.614488 -1.754026
C  0.999243 -0.778717 0.74697
H  0.99607 -1.585251 1.475429
C  2.015405 1.433337 1.292929
O  1.015413 2.078402 1.146384
O  3.093292 1.826547 1.966641
H  2.938998 2.722152 2.301201
C  2.237249 0.041901 0.680217
H  2.533061 0.220853 -0.357801
H  3.064001 -0.450841 1.185707
totalener: -574.17215751836159 hartree
nucrepener: 664.44598558066525 hartree
electener: -1238.61814531058508 hartree
oneelecener: -2083.77460190383090 hartree
twoeener: 845.15645659324593 hartree
kineticenergy: 571.94873890952431 hartree
exchangeener: -50.659404938681 hartree
correlationener: -3.638496428011 hartree
xcener: -54.297901366692 hartree
dispersion: -0.043926720 hartree
dispersion: -0.043062047 hartree
dispersion: -0.043158469 hartree
dispersion: -0.043246217 hartree
dispersion: -0.043229805 hartree
dispersion: -0.043210664 hartree
dispersion: -0.043212727 hartree
dispersion: -0.043213900 hartree
dispersion: -0.043213610 hartree
dispersion: -0.043214914 hartree
dispersion: -0.043215818 hartree
dispersion: -0.043217412 hartree
energy: -529.1506 -527.9599 -526.4626 -287.3174 -287.2971 -285.8397 -285.2213 -285.0287 -284.8641 -284.5550 -284.4779 -284.3254 -38.3040 -37.8106 -35.3372 -32.3901 -30.5635 -29.3866 -28.6278 -26.6230 -25.4004 -24.6279 -23.7096 -23.2330 -21.7030 -21.4678 -20.7433 -20.4020 -20.0869 -19.8641 -19.7724 -19.6153 -18.9645 -18.6448 -18.0612 -17.8779 -17.5986 -17.3114 -16.7985 -15.6230 -14.9056 -14.5538 -14.1498 -5.8034 -2.7156 -1.8465 -1.0980 -0.9269 -0.4578 -0.2048 0.1823 0.5280 1.1133 1.1723 electronvolt
chargesum: 1.0000000
charge: -0.116200 -0.083272 0.012021 -0.029120 -0.125617 0.275360 0.139623 0.163468 0.142661 0.167228 -0.184295 0.246167 0.075870 0.158194 0.296243 -0.292832 -0.237158 0.253905 -0.150740 0.137561 0.150934
charge: 0.010442 0.105280 -0.083268 0.107923 0.034354 -0.112962 0.034579 0.047448 0.043471 0.044186 0.464819 -0.063139 0.171300 0.048822 -0.428996 0.139691 0.391271 -0.067970 0.008557 0.055740 0.048453
qa: -0.1162 -0.0833 0.0120 -0.0291 -0.1256 0.2754 0.1396 0.1635 0.1427 0.1672 -0.1843 0.2462 0.0759 0.1582 0.2962 -0.2928 -0.2372 0.2539 -0.1507 0.1376 0.1509
va: 3.9491 4.0211 3.8372 3.9789 3.9899 4.0316 1.0049 0.9976 1.0108 1.0011 2.3774 1.0035 3.7233 0.9906 4.3471 2.1955 2.2609 1.0044 3.8856 1.0041 1.0147
dispersion: -0.043217888 hartree
energy: -574.220320715167 hartree
dipole: 1.117182654 -1.802486254 -0.685303600 -3.258142333 1.803263897 -1.454878436 0.005954330 -0.191541889 -0.185587559
dipolemethod: SCF
magnitude: 1.618874618 au
magnitude: 4.114852267 debye
temp: 298.15 k
press: 1.00 atm
zeropoint: 0.16785254 hartree
thermalvibcorrection: 0.00772080 hartree
thermalrotcorrection: 0.00141627 hartree
thermaltrasncorrection: 0.00141627 hartree
thermaltotal: -574.04191483 hartree
thermalcorr: 0.01055334 hartree
nonthermalcorr: 0.16785254 hartree
totalcorr: 0.17840588 hartree
thermalcorrenthalpy: 0.00094421 hartree
totalenthalpy: -574.04097062 hartree
vibrat: 0.01324556 hartree
rotat: 0.01465794 hartree
transl: 0.01958192 hartree
total: 0.04748542 hartree
totalentropycorr: -0.04748542 hartree
gibbsenthalpy: -574.08845604 hartree
gibbsminuselec: 0.13186467 hartree
