program: Orca
programVersion: 6.0.0
elementType: C C C C C C H H H H O H C O O H C H C H H
charge: 1
multiplicity: 1
keywords: wB97X-D3BJ TightOpt Freq def2-TZVPP def2/J RIJCOSX TightSCF defgrid3 CHELPG
frequency: 0.00 0.00 0.00 0.00 0.00 0.00 19.77 31.82 67.29 115.00 200.89 239.33 331.51 363.73 409.62 431.14 477.46 516.75 523.01 575.96 589.81 621.50 637.96 692.55 763.31 790.13 828.21 855.89 871.54 887.21 944.59 1010.14 1013.30 1031.34 1043.07 1110.49 1142.78 1194.53 1205.76 1214.65 1215.83 1284.30 1324.05 1362.73 1376.34 1407.24 1453.30 1467.26 1528.86 1540.38 1613.26 1659.13 1691.04 1892.03 3066.11 3193.76 3207.45 3213.08 3227.50 3238.91 3252.59 3789.67 3813.18
frequency: 19.77 31.82 67.29 115.00 200.89 239.33 331.51 363.73 409.62 431.14 477.46 516.75 523.01 575.96 589.81 621.50 637.96 692.55 763.31 790.13 828.21 855.89 871.54 887.21 944.59 1010.14 1013.30 1031.34 1043.07 1110.49 1142.78 1194.53 1205.76 1214.65 1215.83 1284.30 1324.05 1362.73 1376.34 1407.24 1453.30 1467.26 1528.86 1540.38 1613.26 1659.13 1691.04 1892.03 3066.11 3193.76 3207.45 3213.08 3227.50 3238.91 3252.59 3789.67 3813.18
formula: C9H9O3
InChI: InChI=1/C9H9O3/c10-8-4-1-7(2-5-8)3-6-9(11)12/h1-5,10-11H,6H2
21 atoms
C  2.357104 -1.851378 -0.348141
C  1.06499 -1.587871 -0.671779
C  0.494791 -0.283197 -0.473446
C  1.332063 0.744765 0.085834
C  2.621345 0.488387 0.414143
C  3.148184 -0.811933 0.19898
H  2.786588 -2.834994 -0.498875
H  0.439908 -2.368609 -1.089946
H  0.929296 1.734521 0.253872
H  3.271288 1.241886 0.839114
O  4.403289 -0.990215 0.537596
H  4.710006 -1.890663 0.371623
C  -2.801148 0.981409 0.227485
O  -3.079465 1.752856 1.092351
O  -3.48531 -0.133766 -0.07122
H  -4.252552 -0.187463 0.51641
C  -1.597228 1.159454 -0.705476
H  -1.032916 2.018748 -0.359174
C  -0.812047 -0.08783 -0.819605
H  -2.014017 1.382337 -1.695597
H  -1.356861 -0.942376 -1.212238
totalener: -574.09080202240602 hartree
nucrepener: 633.51739981255128 hartree
electener: -1207.60820007788629 hartree
oneelecener: -2021.77290006164526 hartree
twoeener: 814.16469998375896 hartree
kineticenergy: 571.83173574236991 hartree
exchangeener: -50.627411561959 hartree
correlationener: -3.635906212877 hartree
xcener: -54.263317774836 hartree
dispersion: -0.041916050 hartree
dispersion: -0.041858749 hartree
dispersion: -0.041826283 hartree
dispersion: -0.041822102 hartree
dispersion: -0.041827593 hartree
dispersion: -0.041834642 hartree
dispersion: -0.041834398 hartree
dispersion: -0.041835308 hartree
dispersion: -0.041836637 hartree
dispersion: -0.041841676 hartree
dispersion: -0.041857466 hartree
dispersion: -0.041847006 hartree
dispersion: -0.041847398 hartree
dispersion: -0.041854008 hartree
dispersion: -0.041865391 hartree
dispersion: -0.041872333 hartree
dispersion: -0.041879175 hartree
dispersion: -0.041885798 hartree
dispersion: -0.041891926 hartree
dispersion: -0.041896949 hartree
dispersion: -0.041899159 hartree
dispersion: -0.041895574 hartree
dispersion: -0.041879500 hartree
dispersion: -0.041834000 hartree
dispersion: -0.041725151 hartree
dispersion: -0.041515293 hartree
dispersion: -0.041271356 hartree
dispersion: -0.041129084 hartree
dispersion: -0.041079329 hartree
dispersion: -0.041066623 hartree
dispersion: -0.041037277 hartree
dispersion: -0.040981061 hartree
dispersion: -0.041083036 hartree
dispersion: -0.041432339 hartree
dispersion: -0.041749289 hartree
dispersion: -0.041930006 hartree
dispersion: -0.042112196 hartree
dispersion: -0.041963148 hartree
dispersion: -0.042075349 hartree
dispersion: -0.042059837 hartree
dispersion: -0.042050747 hartree
dispersion: -0.041891347 hartree
dispersion: -0.041984276 hartree
dispersion: -0.042033379 hartree
dispersion: -0.041970449 hartree
dispersion: -0.041966006 hartree
dispersion: -0.041946800 hartree
dispersion: -0.041955208 hartree
dispersion: -0.041996062 hartree
dispersion: -0.042043068 hartree
dispersion: -0.042078854 hartree
dispersion: -0.042089863 hartree
dispersion: -0.042090195 hartree
dispersion: -0.042097540 hartree
dispersion: -0.042104246 hartree
dispersion: -0.042108180 hartree
dispersion: -0.042109897 hartree
energy: -529.2282 -527.9311 -526.3416 -287.3903 -287.1728 -286.0546 -285.3487 -285.1859 -285.0267 -284.6761 -284.5269 -284.5176 -38.3833 -37.7017 -35.2445 -32.5472 -30.7203 -29.5274 -28.7869 -26.6797 -25.4977 -24.5052 -23.9885 -23.4177 -21.7609 -21.6821 -20.6057 -20.3643 -20.0427 -19.9789 -19.8650 -19.8409 -18.9458 -18.7279 -18.1288 -17.9390 -17.6572 -17.5055 -16.9430 -15.5711 -14.9666 -14.8240 -13.9507 -5.9029 -2.9428 -1.8246 -1.0659 -1.0065 -0.5297 -0.1225 0.0175 0.6194 1.0195 1.1004 electronvolt
chargesum: 1.0000000
charge: -0.121021 -0.074114 -0.024904 -0.081707 -0.109400 0.272775 0.141399 0.165128 0.162287 0.170631 -0.185772 0.246968 0.275005 -0.239565 -0.270685 0.254293 -0.127916 0.121521 0.106168 0.151396 0.167513
charge: 0.011489 0.104300 -0.088939 0.099603 0.035710 -0.116191 0.035320 0.048179 0.042211 0.044938 0.463670 -0.062933 -0.429895 0.165985 0.367667 -0.070546 0.013957 0.041727 0.174851 0.066552 0.052344
qa: -0.1210 -0.0741 -0.0249 -0.0817 -0.1094 0.2728 0.1414 0.1651 0.1623 0.1706 -0.1858 0.2470 0.2750 -0.2396 -0.2707 0.2543 -0.1279 0.1215 0.1062 0.1514 0.1675
va: 3.9509 4.0154 3.8292 3.9934 3.9683 4.0352 1.0049 0.9983 0.9980 0.9998 2.3754 1.0030 4.3574 2.2607 2.1916 1.0059 3.8665 1.0296 3.6710 1.0030 0.9999
dispersion: -0.042111117 hartree
energy: -574.217906221328 hartree
dipole: 1.245436490 0.238222774 1.483659264 -1.374104842 -0.145704679 -1.519809521 -2.515396269 1.599757626 -0.915638642
dipolemethod: SCF
magnitude: 2.312889949 au
magnitude: 5.878899046 debye
temp: 298.15 k
press: 1.00 atm
zeropoint: 0.16760498 hartree
thermalvibcorrection: 0.00784085 hartree
thermalrotcorrection: 0.00141627 hartree
thermaltrasncorrection: 0.00141627 hartree
thermaltotal: -574.03962785 hartree
thermalcorr: 0.01067339 hartree
nonthermalcorr: 0.16760498 hartree
totalcorr: 0.17827837 hartree
thermalcorrenthalpy: 0.00094421 hartree
totalenthalpy: -574.03868364 hartree
vibrat: 0.01379799 hartree
rotat: 0.01476476 hartree
transl: 0.01958192 hartree
total: 0.04814467 hartree
totalentropycorr: -0.04814467 hartree
gibbsenthalpy: -574.08682831 hartree
gibbsminuselec: 0.13107791 hartree
