program: Orca
programVersion: 6.0.0
elementType: C C C C C C H H H H O H C O O H C H C H H
charge: 1
multiplicity: 1
keywords: wB97X-D3BJ TightOpt Freq def2-TZVPP def2/J RIJCOSX TightSCF defgrid3 CHELPG
frequency: 0.00 0.00 0.00 0.00 0.00 0.00 41.90 69.99 128.31 156.00 238.70 267.10 320.70 394.90 421.16 441.51 464.85 523.28 590.79 597.33 619.67 634.57 683.21 700.14 781.99 809.88 838.86 848.49 858.57 891.77 972.40 998.96 1003.27 1012.10 1041.67 1058.58 1125.48 1142.08 1162.22 1204.78 1217.98 1225.20 1266.75 1362.18 1370.31 1401.42 1439.26 1462.28 1509.10 1540.19 1558.71 1619.43 1693.26 1881.97 3190.38 3209.78 3223.82 3235.23 3238.78 3251.16 3289.40 3788.88 3810.65
frequency: 41.90 69.99 128.31 156.00 238.70 267.10 320.70 394.90 421.16 441.51 464.85 523.28 590.79 597.33 619.67 634.57 683.21 700.14 781.99 809.88 838.86 848.49 858.57 891.77 972.40 998.96 1003.27 1012.10 1041.67 1058.58 1125.48 1142.08 1162.22 1204.78 1217.98 1225.20 1266.75 1362.18 1370.31 1401.42 1439.26 1462.28 1509.10 1540.19 1558.71 1619.43 1693.26 1881.97 3190.38 3209.78 3223.82 3235.23 3238.78 3251.16 3289.40 3788.88 3810.65
formula: C9H9O3
InChI: InChI=1/C9H9O3/c10-6-1-3-9(4-2-6)5-7(9)8(11)12/h1-4,7,10-11H,5H2
21 atoms
C  -1.448345 1.340517 -0.329638
C  -0.202915 0.855472 -0.548938
C  0.105276 -0.536793 -0.332702
C  -0.957965 -1.392076 0.130465
C  -2.204639 -0.914096 0.357257
C  -2.461555 0.463456 0.131131
H  -1.700442 2.379701 -0.49423
H  0.583312 1.510612 -0.900944
H  -0.741598 -2.441656 0.29806
H  -3.000116 -1.562129 0.706396
O  -3.642309 0.994326 0.332215
H  -4.293388 0.353602 0.645893
C  2.521008 0.090941 0.588772
O  2.978998 0.102982 1.691663
O  2.8201 0.978261 -0.376493
H  3.47269 1.59785 -0.019829
C  1.548737 -0.965714 0.135193
H  1.525023 -1.797472 0.825952
C  1.189839 -1.189582 -1.25384
H  1.587025 -0.518534 -2.002477
H  0.95903 -2.19225 -1.585747
totalener: -574.16011780475662 hartree
nucrepener: 677.38644326878944 hartree
electener: -1251.54655896795043 hartree
oneelecener: -2108.80602171723240 hartree
twoeener: 857.25946274928197 hartree
kineticenergy: 571.87085677849382 hartree
exchangeener: -50.666160761470 hartree
correlationener: -3.645891869067 hartree
xcener: -54.312052630537 hartree
dispersion: -0.043349650 hartree
dispersion: -0.043310798 hartree
dispersion: -0.043377505 hartree
dispersion: -0.043340338 hartree
dispersion: -0.043344766 hartree
dispersion: -0.043358125 hartree
dispersion: -0.043368784 hartree
dispersion: -0.043371343 hartree
dispersion: -0.043371001 hartree
dispersion: -0.043369930 hartree
energy: -529.3812 -528.1620 -526.5011 -287.5737 -287.3324 -285.7243 -285.5828 -285.4320 -285.3691 -285.1435 -284.8382 -284.5937 -38.5511 -37.9170 -35.4138 -33.4218 -31.5348 -29.6966 -28.1079 -26.4816 -25.8500 -25.0066 -24.1472 -23.5932 -22.2160 -22.0056 -20.6907 -20.4523 -20.1579 -20.1146 -20.0188 -19.8495 -19.3497 -18.8626 -18.4584 -17.9072 -17.8855 -17.1573 -16.8011 -15.7603 -15.1517 -14.8913 -14.3655 -5.3424 -2.9939 -1.6549 -1.1140 -0.7184 -0.2558 -0.0515 0.0424 0.5270 0.8509 1.0758 electronvolt
chargesum: 1.0000000
charge: -0.137332 -0.055485 0.065464 -0.088621 -0.134716 0.291876 0.171995 0.181256 0.166422 0.142536 -0.183337 0.248090 0.264110 -0.236273 -0.281613 0.251561 -0.016672 0.144767 -0.072507 0.139796 0.138684
charge: 0.032032 0.113367 -0.079782 0.113304 0.014514 -0.112006 0.045337 0.044431 0.052434 0.036564 0.467722 -0.061312 -0.432403 0.170689 0.369053 -0.070547 0.032367 0.054804 0.128565 0.042250 0.038618
qa: -0.1373 -0.0555 0.0655 -0.0886 -0.1347 0.2919 0.1720 0.1813 0.1664 0.1425 -0.1833 0.2481 0.2641 -0.2363 -0.2816 0.2516 -0.0167 0.1448 -0.0725 0.1398 0.1387
va: 3.9774 3.8706 3.8953 3.9707 3.9648 4.0212 1.0003 1.0087 0.9900 1.0049 2.3806 1.0023 4.3752 2.2607 2.1818 1.0084 3.7220 1.0107 3.8253 1.0212 1.0111
dispersion: -0.043369227 hartree
energy: -574.204909518863 hartree
dipole: -1.987808024 0.180002075 -1.807805949 -2.655188681 1.992345278 -0.662843403 -2.877166009 2.043414540 -0.833751469
dipolemethod: SCF
magnitude: 2.098252902 au
magnitude: 5.333335029 debye
temp: 298.15 k
press: 1.00 atm
zeropoint: 0.16820014 hartree
thermalvibcorrection: 0.00730529 hartree
thermalrotcorrection: 0.00141627 hartree
thermaltrasncorrection: 0.00141627 hartree
thermaltotal: -574.02657154 hartree
thermalcorr: 0.01013783 hartree
nonthermalcorr: 0.16820014 hartree
totalcorr: 0.17833798 hartree
thermalcorrenthalpy: 0.00094421 hartree
totalenthalpy: -574.02562733 hartree
vibrat: 0.01226689 hartree
rotat: 0.01457269 hartree
transl: 0.01958192 hartree
total: 0.04642149 hartree
totalentropycorr: -0.04642149 hartree
gibbsenthalpy: -574.07204883 hartree
gibbsminuselec: 0.13286069 hartree
