program: Orca
programVersion: 6.0.0
elementType: C C C C C C H H H H O H C O O H C H C H H
charge: 1
multiplicity: 1
keywords: wB97X-D3BJ TightOpt Freq def2-TZVPP def2/J RIJCOSX TightSCF defgrid3 CHELPG
frequency: 0.00 0.00 0.00 0.00 0.00 0.00 25.71 57.71 73.22 152.88 194.47 255.12 279.45 321.76 383.37 435.41 463.51 474.96 517.14 585.25 599.99 634.95 651.79 662.83 753.35 780.63 795.18 826.58 853.37 950.31 969.22 985.66 1008.47 1024.33 1058.96 1064.75 1129.76 1151.71 1158.79 1191.18 1201.71 1249.85 1260.85 1349.04 1352.68 1368.12 1387.67 1437.71 1456.71 1520.11 1586.91 1721.01 1855.81 1870.34 2975.32 3122.81 3179.92 3188.65 3230.51 3236.61 3246.85 3285.71 3776.73
frequency: 25.71 57.71 73.22 152.88 194.47 255.12 279.45 321.76 383.37 435.41 463.51 474.96 517.14 585.25 599.99 634.95 651.79 662.83 753.35 780.63 795.18 826.58 853.37 950.31 969.22 985.66 1008.47 1024.33 1058.96 1064.75 1129.76 1151.71 1158.79 1191.18 1201.71 1249.85 1260.85 1349.04 1352.68 1368.12 1387.67 1437.71 1456.71 1520.11 1586.91 1721.01 1855.81 1870.34 2975.32 3122.81 3179.92 3188.65 3230.51 3236.61 3246.85 3285.71 3776.73
formula: C9H9O3
InChI: InChI=1/C9H9O3/c10-6-1-3-9(4-2-6)5-7(9)8(11)12/h1,3-4,7,11H,2,5H2
21 atoms
C  2.331759 0.837189 -0.028791
C  0.96919 1.190466 0.350238
C  0.008035 0.228316 0.595399
C  0.341221 -1.203528 0.416507
C  1.514578 -1.584196 -0.087986
C  2.532229 -0.599263 -0.521098
H  2.90828 0.919626 0.913829
H  0.713402 2.242102 0.459583
H  -0.413487 -1.927676 0.693446
H  1.749637 -2.628335 -0.253382
O  3.481679 -0.876188 -1.19922
H  2.791251 1.569498 -0.696977
C  -2.356452 -0.252681 -0.415975
O  -2.636574 -1.298386 0.093902
O  -2.752879 0.180497 -1.607193
H  -3.335763 -0.481279 -2.00906
C  -1.4827 0.791234 0.251232
H  -1.484052 1.766968 -0.215391
C  -1.129794 0.646054 1.630902
H  -0.914325 1.51753 2.232499
H  -1.483608 -0.236145 2.15131
totalener: -574.05871295254281 hartree
nucrepener: 652.94396343366554 hartree
electener: -1227.00267576629767 hartree
oneelecener: -2059.72574824655021 hartree
twoeener: 832.72307248025243 hartree
kineticenergy: 571.85023034931567 hartree
exchangeener: -50.626106830207 hartree
correlationener: -3.637612027520 hartree
xcener: -54.263718857727 hartree
dispersion: -0.040978653 hartree
dispersion: -0.040881878 hartree
dispersion: -0.040855537 hartree
dispersion: -0.040895035 hartree
dispersion: -0.041007124 hartree
dispersion: -0.041103305 hartree
dispersion: -0.041295176 hartree
dispersion: -0.041608769 hartree
dispersion: -0.041920365 hartree
dispersion: -0.042171296 hartree
dispersion: -0.042324550 hartree
dispersion: -0.042405471 hartree
dispersion: -0.042404457 hartree
dispersion: -0.042360961 hartree
dispersion: -0.042459705 hartree
dispersion: -0.042879889 hartree
dispersion: -0.043021256 hartree
dispersion: -0.042715153 hartree
dispersion: -0.042824247 hartree
dispersion: -0.042730212 hartree
dispersion: -0.042859438 hartree
dispersion: -0.042787138 hartree
dispersion: -0.042852723 hartree
dispersion: -0.042759453 hartree
dispersion: -0.042733205 hartree
dispersion: -0.042723502 hartree
dispersion: -0.042736962 hartree
dispersion: -0.042758996 hartree
dispersion: -0.042763941 hartree
dispersion: -0.042768071 hartree
dispersion: -0.042770897 hartree
dispersion: -0.042801618 hartree
dispersion: -0.042799795 hartree
dispersion: -0.042915342 hartree
dispersion: -0.043236314 hartree
dispersion: -0.043462936 hartree
dispersion: -0.043492708 hartree
dispersion: -0.043318180 hartree
dispersion: -0.043311534 hartree
dispersion: -0.043174799 hartree
dispersion: -0.043149797 hartree
dispersion: -0.043088503 hartree
dispersion: -0.043112205 hartree
dispersion: -0.043111647 hartree
dispersion: -0.043096795 hartree
dispersion: -0.043080779 hartree
dispersion: -0.043067365 hartree
dispersion: -0.043063135 hartree
dispersion: -0.043062504 hartree
dispersion: -0.043062003 hartree
dispersion: -0.043062875 hartree
energy: -528.7061 -527.2062 -526.8342 -288.0727 -287.4983 -286.6348 -286.5022 -286.4924 -286.0544 -285.1851 -284.9233 -284.3681 -38.5675 -36.4618 -36.1407 -34.0782 -31.5381 -29.8338 -28.1459 -27.1148 -25.7982 -24.6415 -24.2507 -22.7550 -22.3947 -21.4560 -21.1143 -20.9187 -20.6584 -20.3836 -20.0563 -19.9000 -19.4298 -18.7561 -18.3917 -17.9409 -17.8661 -17.6144 -17.3524 -16.2870 -15.3639 -14.5458 -14.1094 -6.2342 -3.8337 -2.1313 -1.5432 -0.9518 -0.5682 -0.3905 -0.2534 0.0208 0.5524 0.7688 electronvolt
chargesum: 1.0000000
charge: -0.117178 0.049957 0.045859 -0.148045 -0.122661 0.160355 0.160913 0.189593 0.179170 0.170276 -0.204988 0.163748 0.298945 -0.271072 -0.232193 0.260394 0.002342 0.156145 -0.054406 0.153417 0.159427
charge: 0.032429 0.243257 -0.056005 0.046798 0.038248 -0.259968 0.096042 0.060776 0.040972 0.046242 0.210129 0.067999 -0.436434 0.164858 0.401220 -0.059584 0.062242 0.048951 0.151517 0.041646 0.058666
qa: -0.1172 0.0500 0.0459 -0.1480 -0.1227 0.1604 0.1609 0.1896 0.1792 0.1703 -0.2050 0.1637 0.2989 -0.2711 -0.2322 0.2604 0.0023 0.1561 -0.0544 0.1534 0.1594
va: 3.8770 3.6756 3.8224 3.8430 3.8358 4.1806 1.0004 0.9736 1.0075 0.9982 2.2652 1.0103 4.3788 2.2117 2.2811 0.9996 3.7427 1.0035 3.8257 1.0054 1.0189
dispersion: -0.043063455 hartree
energy: -574.144860201294 hartree
dipole: 0.327410620 -0.874193571 -0.546782951 4.007628767 -1.987869787 2.019758980 3.741684737 -2.586672189 1.155012547
dipolemethod: SCF
magnitude: 2.390073622 au
magnitude: 6.075084351 debye
temp: 298.15 k
press: 1.00 atm
zeropoint: 0.16478761 hartree
thermalvibcorrection: 0.00788880 hartree
thermalrotcorrection: 0.00141627 hartree
thermaltrasncorrection: 0.00141627 hartree
thermaltotal: -573.96935125 hartree
thermalcorr: 0.01072134 hartree
nonthermalcorr: 0.16478761 hartree
totalcorr: 0.17550895 hartree
thermalcorrenthalpy: 0.00094421 hartree
totalenthalpy: -573.96840704 hartree
vibrat: 0.01357380 hartree
rotat: 0.01457433 hartree
transl: 0.01958192 hartree
total: 0.04773004 hartree
totalentropycorr: -0.04773004 hartree
gibbsenthalpy: -574.01613708 hartree
gibbsminuselec: 0.12872312 hartree
