program: Orca
programVersion: 6.0.0
elementType: C C C C C C H H H H O H C H H C H C O H H H N O H
charge: 1
multiplicity: 1
keywords: wB97X-D3BJ TightOpt Freq def2-TZVPP def2/J RIJCOSX TightSCF defgrid3 CHELPG
frequency: 0.00 0.00 0.00 0.00 0.00 0.00 37.96 47.40 62.51 70.92 168.17 191.45 217.13 287.30 319.80 359.97 392.17 398.02 429.13 434.15 493.65 525.44 556.77 603.11 628.72 656.76 728.83 748.84 792.38 838.12 860.22 871.78 886.71 911.88 946.77 984.47 1011.38 1039.28 1054.14 1075.27 1115.14 1148.62 1198.16 1207.31 1208.00 1245.12 1254.67 1305.42 1336.30 1343.92 1366.27 1371.58 1390.45 1417.10 1494.49 1498.79 1505.30 1580.56 1644.96 1661.29 1671.92 1699.96 1905.92 3084.32 3146.14 3156.67 3178.80 3190.50 3208.84 3234.56 3325.72 3482.45 3540.37 3780.30 3873.78
frequency: 37.96 47.40 62.51 70.92 168.17 191.45 217.13 287.30 319.80 359.97 392.17 398.02 429.13 434.15 493.65 525.44 556.77 603.11 628.72 656.76 728.83 748.84 792.38 838.12 860.22 871.78 886.71 911.88 946.77 984.47 1011.38 1039.28 1054.14 1075.27 1115.14 1148.62 1198.16 1207.31 1208.00 1245.12 1254.67 1305.42 1336.30 1343.92 1366.27 1371.58 1390.45 1417.10 1494.49 1498.79 1505.30 1580.56 1644.96 1661.29 1671.92 1699.96 1905.92 3084.32 3146.14 3156.67 3178.80 3190.50 3208.84 3234.56 3325.72 3482.45 3540.37 3780.30 3873.78
formula: C9H12NO3
InChI: InChI=1/C9H12NO3/c10-8(9(12)13)5-6-1-3-7(11)4-2-6/h1-4,8,11-12H,5H2,10H3
25 atoms
C  1.73686 -1.557483 1.515194
C  0.81062 -0.531615 1.414579
C  0.761011 0.293155 0.288344
C  1.675162 0.065446 -0.739769
C  2.609475 -0.952287 -0.651021
C  2.642584 -1.771736 0.478596
H  1.787163 -2.185784 2.395298
H  0.138334 -0.348883 2.24866
H  1.674229 0.704038 -1.61761
H  3.32285 -1.105283 -1.453669
O  3.526068 -2.780481 0.629454
H  4.132253 -2.821509 -0.115082
C  -0.29794 1.359452 0.158632
H  -0.710535 1.616148 1.138395
H  0.094187 2.27856 -0.2777
C  -1.433042 0.881375 -0.763751
H  -1.054931 0.7314 -1.774191
C  -2.567681 1.893074 -0.813563
O  -3.634707 1.481612 -0.099603
H  -4.313155 2.172609 -0.119518
H  -2.530884 -0.337183 0.535869
H  -2.442641 -0.967917 -0.983305
N  -1.918087 -0.458584 -0.273043
O  -2.473569 2.931453 -1.387598
H  -1.091812 -1.006073 0.009927
totalener: -630.81702071216876 hartree
nucrepener: 789.98537680163247 hartree
electener: -1420.80240682220119 hartree
oneelecener: -2409.49083761508564 hartree
twoeener: 988.68843079288433 hartree
kineticenergy: 628.30676515249536 hartree
exchangeener: -55.783286840372 hartree
correlationener: -4.057496327469 hartree
xcener: -59.840783167841 hartree
dispersion: -0.051199701 hartree
dispersion: -0.050266468 hartree
dispersion: -0.050586700 hartree
dispersion: -0.050743318 hartree
dispersion: -0.050728837 hartree
dispersion: -0.050682757 hartree
dispersion: -0.050666936 hartree
dispersion: -0.050657770 hartree
dispersion: -0.050659216 hartree
dispersion: -0.050662531 hartree
dispersion: -0.050663451 hartree
dispersion: -0.050663514 hartree
dispersion: -0.050663060 hartree
energy: -528.8531 -527.0536 -526.9007 -400.5053 -287.8423 -286.4341 -284.8794 -284.3519 -283.6463 -283.5205 -283.4601 -283.1874 -283.0548 -38.5424 -36.1553 -35.9804 -35.9075 -31.1082 -29.9446 -28.0614 -27.8153 -26.1453 -25.1387 -24.3259 -23.9305 -23.7905 -23.2117 -22.2556 -21.7127 -20.9538 -20.8243 -20.1624 -19.8283 -19.4697 -18.7300 -18.5972 -18.5858 -18.2021 -17.8850 -17.7008 -16.9384 -16.4591 -16.2751 -15.9082 -15.6165 -15.1234 -13.3532 -12.2304 -2.4185 -2.1543 -1.9433 -1.4287 -0.8782 -0.5134 -0.1441 -0.0253 0.2864 0.6670 0.8391 electronvolt
chargesum: 1.0000000
charge: -0.130218 -0.241754 0.002139 -0.176160 -0.130612 0.197375 0.151422 0.154362 0.145971 0.122414 -0.263528 0.220793 -0.211601 0.138309 0.161389 0.007064 0.169193 0.267348 -0.295752 0.260442 0.235254 0.244570 -0.046389 -0.226058 0.244022
charge: 0.009334 -0.022799 -0.122312 0.000847 -0.001866 -0.188138 0.033628 0.024696 0.030852 0.026020 0.377986 -0.098448 0.009671 0.041435 0.053684 -0.037993 0.049940 -0.439813 0.353747 -0.063150 0.051753 0.056979 0.618893 0.184784 0.050269
qa: -0.1302 -0.2418 0.0021 -0.1762 -0.1306 0.1974 0.1514 0.1544 0.1460 0.1224 -0.2635 0.2208 -0.2116 0.1383 0.1614 0.0071 0.1692 0.2673 -0.2958 0.2604 0.2353 0.2446 -0.0464 -0.2261 0.2440
va: 4.0077 3.9699 3.5358 4.0584 3.9419 4.1016 1.0063 0.9988 1.0031 1.0062 2.2406 1.0234 3.8756 1.0040 1.0095 3.7523 1.0000 4.3790 2.1804 1.0038 0.9911 0.9684 3.6378 2.2793 0.9970
dispersion: -0.050662879 hartree
energy: -630.872284257395 hartree
dipole: -1.114230544 -1.101694157 -2.215924701 -2.073732104 1.168047397 -0.905684707 0.402172328 -0.860751502 -0.458579174
dipolemethod: SCF
magnitude: 2.437392444 au
magnitude: 6.195359240 debye
temp: 298.15 k
press: 1.00 atm
zeropoint: 0.21051249 hartree
thermalvibcorrection: 0.00944384 hartree
thermalrotcorrection: 0.00141627 hartree
thermaltrasncorrection: 0.00141627 hartree
thermaltotal: -630.64949538 hartree
thermalcorr: 0.01227638 hartree
nonthermalcorr: 0.21051249 hartree
totalcorr: 0.22278887 hartree
thermalcorrenthalpy: 0.00094421 hartree
totalenthalpy: -630.64855117 hartree
vibrat: 0.01624468 hartree
rotat: 0.01494583 hartree
transl: 0.01972090 hartree
total: 0.05091142 hartree
totalentropycorr: -0.05091142 hartree
gibbsenthalpy: -630.69946259 hartree
gibbsminuselec: 0.17282166 hartree
