program: Orca
programVersion: 6.0.0
elementType: C C C C C C H H H H O H C H H C H C O O H H H H N
charge: 1
multiplicity: 1
keywords: wB97X-D3BJ TightOpt Freq def2-TZVPP def2/J RIJCOSX TightSCF defgrid3 CHELPG
frequency: 0.00 0.00 0.00 0.00 0.00 0.00 30.91 44.48 63.31 96.24 152.82 213.71 243.56 285.27 310.68 324.96 382.52 391.82 426.58 434.08 469.08 527.21 562.89 616.78 649.30 658.38 738.27 767.44 800.87 809.72 848.43 870.62 881.97 945.60 960.56 979.37 1007.29 1018.98 1040.59 1091.46 1134.20 1151.49 1197.21 1206.65 1209.92 1232.07 1251.20 1326.40 1333.59 1350.17 1353.32 1372.05 1384.12 1470.91 1490.98 1500.21 1505.79 1583.12 1640.20 1674.02 1679.67 1704.28 1837.41 3056.93 3108.56 3162.44 3183.91 3188.89 3207.05 3233.89 3311.76 3492.81 3546.57 3773.56 3878.26
frequency: 30.91 44.48 63.31 96.24 152.82 213.71 243.56 285.27 310.68 324.96 382.52 391.82 426.58 434.08 469.08 527.21 562.89 616.78 649.30 658.38 738.27 767.44 800.87 809.72 848.43 870.62 881.97 945.60 960.56 979.37 1007.29 1018.98 1040.59 1091.46 1134.20 1151.49 1197.21 1206.65 1209.92 1232.07 1251.20 1326.40 1333.59 1350.17 1353.32 1372.05 1384.12 1470.91 1490.98 1500.21 1505.79 1583.12 1640.20 1674.02 1679.67 1704.28 1837.41 3056.93 3108.56 3162.44 3183.91 3188.89 3207.05 3233.89 3311.76 3492.81 3546.57 3773.56 3878.26
formula: C9H12NO3
InChI: InChI=1/C9H12NO3/c10-8(9(12)13)5-6-1-3-7(11)4-2-6/h1-4,8,11-12H,5H2,10H3
25 atoms
C  2.353296 0.963244 1.177751
C  1.178875 0.239218 1.265161
C  0.685949 -0.463918 0.168107
C  1.401713 -0.434082 -1.023191
C  2.580071 0.287425 -1.127111
C  3.058365 0.99218 -0.024288
H  2.746867 1.502524 2.029877
H  0.643679 0.2149 2.209544
H  1.049124 -0.989336 -1.887222
H  3.132827 0.295913 -2.060281
O  4.2008 1.715371 -0.053155
H  4.621613 1.650717 -0.91424
C  -0.617137 -1.214003 0.264971
H  -0.546784 -2.173583 -0.257426
H  -0.852695 -1.419355 1.313827
C  -1.789864 -0.431538 -0.349492
H  -1.659366 -0.288603 -1.420704
C  -2.023375 0.896849 0.366908
O  -2.782354 0.957595 1.303341
O  -1.323176 1.886169 -0.14315
H  -1.457387 2.688234 0.384389
H  -3.786482 -1.000507 -0.797935
H  -2.900792 -2.209652 -0.088564
H  -3.413835 -0.88278 0.813328
N  -3.065577 -1.203404 -0.105261
totalener: -630.81468249332761 hartree
nucrepener: 806.25573816098154 hartree
electener: -1437.07042161589652 hartree
oneelecener: -2442.81005441423622 hartree
twoeener: 1005.73963279833970 hartree
kineticenergy: 628.30633358483340 hartree
exchangeener: -55.785607277026 hartree
correlationener: -4.057545097596 hartree
xcener: -59.843152374622 hartree
dispersion: -0.050903707 hartree
dispersion: -0.049872616 hartree
dispersion: -0.049961894 hartree
dispersion: -0.050147052 hartree
dispersion: -0.050215998 hartree
dispersion: -0.050208310 hartree
dispersion: -0.050233299 hartree
dispersion: -0.050314122 hartree
dispersion: -0.050418003 hartree
dispersion: -0.050457684 hartree
dispersion: -0.050462025 hartree
dispersion: -0.050460081 hartree
dispersion: -0.050460368 hartree
dispersion: -0.050459908 hartree
energy: -528.7824 -527.4089 -526.4360 -400.6322 -288.0732 -286.5222 -284.4244 -284.3424 -283.1285 -282.9680 -282.8918 -282.6418 -282.4766 -38.7429 -36.5676 -35.8534 -35.4188 -30.7992 -29.7591 -27.6941 -27.2771 -26.1401 -24.8270 -24.5424 -24.1433 -23.5994 -22.6164 -21.7203 -21.5433 -21.1787 -20.6881 -20.4829 -19.6637 -19.2599 -18.6520 -18.3811 -18.1221 -17.7120 -17.5454 -17.3982 -16.5318 -16.4817 -15.9990 -15.5623 -15.3232 -15.1317 -12.7505 -11.6952 -2.4895 -2.2219 -1.4195 -1.3486 -0.8386 -0.5664 -0.3073 0.1193 0.5443 0.6473 1.1365 electronvolt
chargesum: 1.0000000
charge: -0.142834 -0.156387 0.017388 -0.178029 -0.140391 0.196977 0.142132 0.132287 0.121164 0.111554 -0.270166 0.216926 -0.200964 0.125978 0.141944 0.023348 0.169888 0.269987 -0.300302 -0.209555 0.259955 0.243425 0.237503 0.241967 -0.053793
charge: 0.009432 -0.001973 -0.110796 -0.001120 -0.008931 -0.187094 0.031323 0.026008 0.023825 0.022178 0.371328 -0.102348 -0.006599 0.036502 0.041562 -0.032313 0.043542 -0.442968 0.137580 0.430911 -0.056102 0.058273 0.054420 0.046431 0.616932
qa: -0.1428 -0.1564 0.0174 -0.1780 -0.1404 0.1970 0.1421 0.1323 0.1212 0.1116 -0.2702 0.2169 -0.2010 0.1260 0.1419 0.0233 0.1699 0.2700 -0.3003 -0.2096 0.2600 0.2434 0.2375 0.2420 -0.0538
va: 4.0058 4.0216 3.5980 4.0697 3.9633 4.0847 1.0080 1.0022 1.0047 1.0074 2.2312 1.0259 3.9061 1.0037 1.0042 3.7543 1.0000 4.3802 2.1905 2.3144 1.0010 0.9695 0.9725 1.0082 3.6438
dispersion: -0.050461251 hartree
energy: -630.869631196546 hartree
dipole: -4.656747185 0.876504107 -3.780243078 -6.329515354 4.419919043 -1.909596312 -2.119184170 0.822227506 -1.296956663
dipolemethod: SCF
magnitude: 4.429321888 au
magnitude: 11.258441516 debye
temp: 298.15 k
press: 1.00 atm
zeropoint: 0.21045566 hartree
thermalvibcorrection: 0.00942577 hartree
thermalrotcorrection: 0.00141627 hartree
thermaltrasncorrection: 0.00141627 hartree
thermaltotal: -630.64691722 hartree
thermalcorr: 0.01225831 hartree
nonthermalcorr: 0.21045566 hartree
totalcorr: 0.22271397 hartree
thermalcorrenthalpy: 0.00094421 hartree
totalenthalpy: -630.64597301 hartree
vibrat: 0.01627292 hartree
rotat: 0.01488296 hartree
transl: 0.01972090 hartree
total: 0.05087679 hartree
totalentropycorr: -0.05087679 hartree
gibbsenthalpy: -630.69684980 hartree
gibbsminuselec: 0.17278139 hartree
