program: Gaussian 09
title: 000004649
version: EM64L-G09RevD.01
frameworkgroup: C1[X(C7H7NO3)]
method: RPBEPBE
basis: SDD
operation: Freq
keyword: #pfreq=noraman
keyword: PBEPBE/SDD
title: #p freq=noraman PBEPBE/SDD
converged: NO YES NO YES
title: Mulliken charges:
elementType: O O O N C C C C C C C H H H H H H H
charge: -0.416246 -0.432268 -0.348253 -0.686458 0.095853 0.197884 0.569467 -0.546078 -0.300138 -0.437129 0.164702 0.248175 0.265635 0.222681 0.314433 0.316643 0.385572 0.385525
chargesum: 0.00000
title: Mulliken charges with hydrogens summed into heavy atoms:
elementType: O O O N C C C C C C C
charge: -0.030674 -0.046744 -0.348253 -0.055382 0.095853 0.197884 0.569467 -0.297903 -0.034503 -0.214447 0.164702
polarizability: 1.64679703e+02 2.60526552e+00 9.97826679e+01 4.91330111e-03 -1.90369715e-04 3.85246056e+01
1716.lowfreq: -9.4289 -8.0051 -0.0003 -0.0001 0.0004 10.2168 98.3891 118.1503 211.1011
frequency: 98.3877 118.1492 211.1006 222.7321 270.0761 332.8633 351.7808 418.7859 423.9694 434.7367 454.0763 502.4772 558.5192 566.1741 579.8035 631.8849 678.0403 716.0163 735.6886 745.1812 809.6802 851.7102 862.0285 947.6524 964.0010 1014.7439 1044.5402 1129.3088 1181.9458 1200.6619 1231.6481 1312.9040 1347.9828 1406.9846 1414.0216 1468.1715 1507.1146 1569.7122 1594.7409 1646.7358 1665.3526 2993.2324 3136.2952 3156.8333 3171.3186 3535.0545 3559.6764 3699.7695
redmass: 4.8496 10.7831 5.6863 5.2502 4.6371 4.2896 5.5727 1.0832 8.2727 1.3617 2.0703 5.1816 1.1824 5.5569 5.3932 5.3773 3.0193 4.7991 6.8703 3.0893 1.5978 1.6057 1.2201 2.7544 1.3347 4.4753 1.4915 1.4968 1.5597 2.0444 1.5875 1.9936 3.0175 2.4644 5.6266 4.0298 4.0138 4.5654 4.2836 1.2057 5.0761 1.0697 1.0889 1.0921 1.0959 1.0641 1.0452 1.1040
irintensity: 3.1827 1.0915 1.0212 3.0686 0.2507 10.8422 4.1572 67.0791 6.2821 220.2378 38.1685 4.5414 114.0130 49.5070 10.0518 3.9678 41.6253 6.3955 1.1215 0.5144 29.0123 197.6245 26.4451 25.0665 0.0838 208.4382 75.3940 185.5395 73.8216 64.0379 61.6256 111.2726 75.5193 176.9448 73.4504 212.4951 89.0571 142.9246 45.6600 108.1736 653.9978 263.2966 11.1764 6.6104 5.4617 72.5776 109.6298 25.8161
temp: 298.150 k
press: 1.00000 atm
elementType: 8 8 8 7 6 6 6 6 6 6 6 1 1 1 1 1 1 1
symmnumber: 1
zpe: 349753.8 jmol-1
zpe.correction: 0.133214 hartree
zpe.thermalcorrener: 0.142677 hartree
zpe.thermalcorrenthalpy: 0.143621 hartree
zpe.thermalcorrgfe: 0.098913 hartree
zpe.sumelectzpe: -550.602077 hartree
zpe.sumelectthermal: -550.592614 hartree
zpe.sumelectthermalent: -550.591670 hartree
zpe.sumelectthermalfe: -550.636378 hartree
dipole: -3.7647 -2.5108 0.0047
dipole: 4.5252
quadrupole: -40.5745 -64.5082 -67.5951
quadrupole: -4.2448 0.0268 0.0002
quadrupole: 16.9848 -6.9489 -10.0359 -4.2448 0.0268 0.0002
hfenergy: -550.7352909 hartree
pointgroup: C01 [X(C7H7N1O3)]
dipole: -1.4879645 0.9748816 0.0718869 debye
dipolederiv: -0.7032991 0.3929144 0.0222804 0.3566305 -0.996237 -0.0312753 0.0213149 -0.0328109 -0.4058041 -0.7919011 -0.4817575 -0.0093642 -0.8730573 -0.9938605 0.000726 -0.0243812 -0.0092693 -0.4232374 -1.2522942 0.2365545 0.0307001 0.4585996 -0.8947761 -0.0308864 0.0386158 -0.0255648 -0.3737574 -1.764866 0.0217774 0.0266315 -0.09742 -0.1363785 0.0247848 0.0222706 0.0218181 -0.7164134 -1.4490511 -0.1575628 0.0274924 0.1226411 -0.4379722 -0.015886 0.0383357 -0.0087365 -0.1024073 1.0691265 -0.4317231 -0.0395978 -0.0601448 0.911112 0.03108 -0.0262278 0.040934 0.1369227 1.8718241 -0.058092 -0.0443901 0.1659404 0.4199411 0.0048226 -0.036711 0.0104704 0.1806344 -0.7767814 0.3126818 0.0243636 0.4305711 -0.1445575 -0.0055382 0.0290066 -0.0026421 -0.2784837 0.7569914 -0.0523798 -0.0219893 -0.3851633 0.103284 0.0154608 -0.0340348 0.0073738 -0.0510545 -0.7261479 -0.0984701 0.0077761 -0.5396699 -0.1035068 0.0194693 -0.008887 0.0081864 -0.2697574 2.4817569 0.1855649 -0.048464 0.2691655 1.3408789 0.0339642 -0.0453635 0.036074 0.24823 0.0189568 -0.0680378 0.0015093 -0.0729092 -0.0266392 -0.0063201 0.0014795 -0.0065185 0.187197 0.0954082 -0.0621408 -0.0009744 -0.0386839 -0.0036225 -0.0049093 -0.0002851 -0.0043696 0.1513538 -0.0234261 0.1046361 0.0088565 0.0855008 -0.0462127 -0.0105019 0.008117 -0.0108265 0.1775981 0.248092 -0.0115484 0.0030913 -0.0620389 0.128992 -0.0083394 0.0014994 -0.0095852 0.3854117 0.2313379 0.0127832 0.0044674 0.0756229 0.1228556 -0.0119526 0.0067879 -0.0103644 0.3852802 0.4687574 0.064751 0.0000364 -0.0220427 0.4516909 0.0037109 -0.0030739 0.0016074 0.3690629 0.2455158 0.0900489 0.0075748 0.1864579 0.3050085 -0.0084092 0.0115371 -0.0057763 0.3992243 unknown
polarizability: 164.636672|-2.0071163|99.656844|-3.2114526|2.3576988|38.6934609 unknown
InChI: InChI=1S/C7H7NO3/c8-4-1-2-5(7(10)11)6(9)3-4/h1-3,9-10H,8H2
charge 0 multiplicity 1
18 atoms
O  0.668717 -2.201724 -0.136606
O  2.684749 1.540564 -0.045134
O  2.830309 -0.771342 -0.134848
N  -3.59052 0.062514 0.055452
C  0.642936 0.260416 -0.041904
C  -0.032545 -1.015395 -0.073184
C  -2.204572 0.11596 0.022486
C  -1.4382 -1.076837 -0.041459
C  -0.146281 1.446297 0.021887
C  -1.538991 1.389905 0.054429
C  2.092183 0.277426 -0.077462
H  -1.916126 -2.061137 -0.067259
H  0.370281 2.410407 0.045555
H  -2.131409 2.310423 0.103347
H  -4.143341 0.91388 0.102452
H  -4.079982 -0.827978 0.033713
H  1.666252 -1.97821 -0.153458
H  3.671642 1.423232 -0.075907
