program: Orca
programVersion: 6.0.0
elementType: C C C C C C H H H H O H C H H C H C O O H H H H N
charge: 1
multiplicity: 1
keywords: wB97X-D3BJ TightOpt Freq def2-TZVPP def2/J RIJCOSX TightSCF defgrid3 CHELPG
frequency: 0.00 0.00 0.00 0.00 0.00 0.00 43.99 55.41 63.91 88.03 169.99 189.11 216.12 296.76 327.31 361.78 394.69 399.68 429.29 433.09 484.08 525.28 568.64 613.22 655.87 657.78 732.93 750.51 799.49 845.83 859.54 872.19 890.19 925.37 957.08 980.01 1016.71 1039.33 1070.57 1092.72 1129.44 1151.64 1195.35 1206.49 1211.35 1245.38 1257.37 1297.03 1335.77 1346.68 1369.39 1371.70 1393.71 1463.41 1485.83 1495.63 1501.40 1580.80 1640.31 1668.45 1671.29 1700.11 1846.32 3087.10 3145.32 3158.38 3182.92 3190.54 3208.57 3234.25 3323.98 3384.87 3536.77 3776.14 3873.68
frequency: 43.99 55.41 63.91 88.03 169.99 189.11 216.12 296.76 327.31 361.78 394.69 399.68 429.29 433.09 484.08 525.28 568.64 613.22 655.87 657.78 732.93 750.51 799.49 845.83 859.54 872.19 890.19 925.37 957.08 980.01 1016.71 1039.33 1070.57 1092.72 1129.44 1151.64 1195.35 1206.49 1211.35 1245.38 1257.37 1297.03 1335.77 1346.68 1369.39 1371.70 1393.71 1463.41 1485.83 1495.63 1501.40 1580.80 1640.31 1668.45 1671.29 1700.11 1846.32 3087.10 3145.32 3158.38 3182.92 3190.54 3208.57 3234.25 3323.98 3384.87 3536.77 3776.14 3873.68
formula: C9H12NO3
InChI: InChI=1/C9H12NO3/c10-8(9(12)13)5-6-1-3-7(11)4-2-6/h1-4,8,11-12H,5H2,10H3
25 atoms
C  2.701904 0.758938 0.584608
C  1.3587 1.106901 0.490787
C  0.526541 0.517519 -0.457253
C  1.073122 -0.438033 -1.320238
C  2.404025 -0.792508 -1.239259
C  3.228309 -0.193327 -0.281806
H  3.337878 1.24152 1.318663
H  0.969009 1.877218 1.150208
H  0.451942 -0.897523 -2.083005
H  2.834319 -1.520311 -1.915475
O  4.520107 -0.582551 -0.25789
H  5.016559 -0.088626 0.400176
C  -0.942687 0.853567 -0.508158
H  -1.143515 1.771109 0.051278
H  -1.291365 1.012918 -1.529044
C  -1.783999 -0.293649 0.084847
H  -1.751742 -1.167622 -0.56376
C  -3.217998 0.141083 0.351916
O  -3.610694 0.368939 1.467612
O  -3.91009 0.266491 -0.766105
H  -4.802708 0.584379 -0.562721
H  -1.347067 -1.668905 1.627712
H  -0.219543 -0.452821 1.442254
H  -1.742806 -0.14668 2.136456
N  -1.223847 -0.67845 1.42338
totalener: -630.82350658133100 hartree
nucrepener: 791.06400121159879 hartree
electener: -1421.88750788131733 hartree
oneelecener: -2411.71285151460552 hartree
twoeener: 989.82534363328818 hartree
kineticenergy: 628.30916792646997 hartree
exchangeener: -55.787172505778 hartree
correlationener: -4.058828808471 hartree
xcener: -59.846001314249 hartree
dispersion: -0.051162718 hartree
dispersion: -0.050321766 hartree
dispersion: -0.050586502 hartree
dispersion: -0.050776760 hartree
dispersion: -0.050736867 hartree
dispersion: -0.050683370 hartree
dispersion: -0.050672996 hartree
dispersion: -0.050670462 hartree
dispersion: -0.050676384 hartree
dispersion: -0.050681825 hartree
dispersion: -0.050684209 hartree
dispersion: -0.050683527 hartree
dispersion: -0.050684530 hartree
energy: -528.7883 -527.3647 -526.8882 -400.2342 -288.0263 -286.3892 -284.8636 -284.3647 -283.6343 -283.5331 -283.3972 -283.1642 -283.0339 -38.6991 -36.4327 -35.8944 -35.6773 -31.0852 -29.9236 -28.0541 -27.7819 -26.0534 -24.8797 -24.3071 -24.1374 -23.8777 -23.2000 -21.7412 -21.5606 -21.2276 -20.6802 -20.5226 -19.8094 -19.5503 -18.8183 -18.5297 -18.3064 -18.1613 -17.8704 -17.7496 -16.8702 -16.4701 -16.4536 -15.9204 -15.6027 -15.4276 -13.3236 -12.2181 -2.3189 -2.1301 -1.8994 -1.4418 -0.6767 -0.5747 -0.0311 0.1967 0.3349 0.8029 0.9355 electronvolt
chargesum: 1.0000000
charge: -0.131268 -0.249002 -0.014162 -0.154297 -0.130546 0.197611 0.124284 0.160864 0.139580 0.150320 -0.263023 0.220187 -0.203768 0.136794 0.155180 0.014432 0.159383 0.289556 -0.296824 -0.230883 0.260817 0.240751 0.236931 0.234547 -0.047466
charge: -0.012108 -0.020624 -0.122706 -0.000624 0.019929 -0.187949 0.024468 0.026302 0.029504 0.035060 0.378222 -0.098551 0.008508 0.043055 0.049417 -0.037768 0.044107 -0.441313 0.138769 0.412953 -0.057389 0.056119 0.045249 0.044784 0.622585
qa: -0.1313 -0.2490 -0.0142 -0.1543 -0.1305 0.1976 0.1243 0.1609 0.1396 0.1503 -0.2630 0.2202 -0.2038 0.1368 0.1552 0.0144 0.1594 0.2896 -0.2968 -0.2309 0.2608 0.2408 0.2369 0.2345 -0.0475
va: 3.9485 3.9879 3.5690 4.0374 3.9998 4.1022 1.0055 0.9992 1.0021 1.0072 2.2416 1.0237 3.8543 1.0075 1.0081 3.8044 1.0039 4.3710 2.1924 2.2910 0.9994 0.9714 1.0067 1.0098 3.6396
dispersion: -0.050684577 hartree
energy: -630.879041857623 hartree
dipole: 0.278041729 -1.700303023 -1.422261294 -0.226567253 -0.365036424 -0.591603677 1.336550251 -0.088619192 1.247931059
dipolemethod: SCF
magnitude: 1.982461608 au
magnitude: 5.039016951 debye
temp: 298.15 k
press: 1.00 atm
zeropoint: 0.21067086 hartree
thermalvibcorrection: 0.00931748 hartree
thermalrotcorrection: 0.00141627 hartree
thermaltrasncorrection: 0.00141627 hartree
thermaltotal: -630.65622097 hartree
thermalcorr: 0.01215002 hartree
nonthermalcorr: 0.21067086 hartree
totalcorr: 0.22282089 hartree
thermalcorrenthalpy: 0.00094421 hartree
totalenthalpy: -630.65527676 hartree
vibrat: 0.01596172 hartree
rotat: 0.01494111 hartree
transl: 0.01972090 hartree
total: 0.05062374 hartree
totalentropycorr: -0.05062374 hartree
gibbsenthalpy: -630.70590050 hartree
gibbsminuselec: 0.17314135 hartree
