program: Orca
programVersion: 6.0.0
elementType: C C C C C C H H H H O H C H H C H C O H H H N O H
charge: 1
multiplicity: 1
keywords: wB97X-D3BJ TightOpt Freq def2-TZVPP def2/J RIJCOSX TightSCF defgrid3 CHELPG
frequency: 0.00 0.00 0.00 0.00 0.00 0.00 44.71 57.36 63.32 88.71 169.56 190.99 216.03 295.28 327.18 363.37 390.29 398.81 429.35 433.65 484.15 524.07 568.35 613.08 655.99 657.59 732.73 751.23 799.66 846.29 860.46 872.66 889.29 925.34 955.74 984.67 1011.21 1039.28 1069.88 1091.88 1129.10 1150.96 1197.95 1206.72 1211.26 1246.05 1257.60 1295.77 1335.93 1344.70 1371.02 1371.68 1391.26 1463.74 1487.10 1495.74 1500.85 1580.67 1640.29 1668.00 1673.12 1700.00 1846.93 3086.98 3146.15 3158.15 3180.11 3189.82 3208.50 3234.79 3323.59 3386.90 3536.40 3776.15 3874.44
frequency: 44.71 57.36 63.32 88.71 169.56 190.99 216.03 295.28 327.18 363.37 390.29 398.81 429.35 433.65 484.15 524.07 568.35 613.08 655.99 657.59 732.73 751.23 799.66 846.29 860.46 872.66 889.29 925.34 955.74 984.67 1011.21 1039.28 1069.88 1091.88 1129.10 1150.96 1197.95 1206.72 1211.26 1246.05 1257.60 1295.77 1335.93 1344.70 1371.02 1371.68 1391.26 1463.74 1487.10 1495.74 1500.85 1580.67 1640.29 1668.00 1673.12 1700.00 1846.93 3086.98 3146.15 3158.15 3180.11 3189.82 3208.50 3234.79 3323.59 3386.90 3536.40 3776.15 3874.44
formula: C9H12NO3
InChI: InChI=1/C9H12NO3/c10-8(9(12)13)5-6-1-3-7(11)4-2-6/h1-4,8,11-12H,5H2,10H3
25 atoms
C  1.535825 -2.368301 0.122356
C  0.500861 -1.651413 -0.453188
C  0.568042 -0.263965 -0.572497
C  1.708001 0.388725 -0.097806
C  2.749593 -0.315416 0.485652
C  2.666152 -1.701152 0.598206
H  1.473488 -3.448858 0.193794
H  -0.363535 -2.187863 -0.831936
H  1.804078 1.464608 -0.216942
H  3.640491 0.188118 0.838653
O  3.709407 -2.338439 1.169798
H  3.57622 -3.290079 1.164891
C  -0.587878 0.524201 -1.134794
H  -0.259565 1.524001 -1.43128
H  -1.017085 0.048686 -2.017139
C  -1.717901 0.652695 -0.094496
H  -2.187023 -0.314014 0.08183
C  -2.745593 1.696729 -0.507917
O  -3.508317 1.270221 -1.49867
H  -4.120112 1.973269 -1.764387
H  -1.657554 0.791713 2.012173
H  -0.162635 0.84609 1.272251
N  -1.146124 1.142987 1.204059
O  -2.787739 2.781703 0.013249
H  -1.229287 2.16926 1.207665
totalener: -630.82343682044018 hartree
nucrepener: 791.06224842459676 hartree
electener: -1421.88568749472188 hartree
oneelecener: -2411.71915942471833 hartree
twoeener: 989.83347192999656 hartree
kineticenergy: 628.30977017582654 hartree
exchangeener: -55.787316272907 hartree
correlationener: -4.058916005520 hartree
xcener: -59.846232278427 hartree
dispersion: -0.051166576 hartree
dispersion: -0.050225216 hartree
dispersion: -0.050503731 hartree
dispersion: -0.050887184 hartree
dispersion: -0.050724151 hartree
dispersion: -0.050675951 hartree
dispersion: -0.050660074 hartree
dispersion: -0.050663547 hartree
dispersion: -0.050676266 hartree
dispersion: -0.050681841 hartree
dispersion: -0.050683551 hartree
dispersion: -0.050682760 hartree
energy: -528.7861 -527.3595 -526.8830 -400.2338 -288.0220 -286.3914 -284.8599 -284.3634 -283.6324 -283.4869 -283.4488 -283.1812 -283.0325 -38.6953 -36.4287 -35.8895 -35.6759 -31.0864 -29.9256 -28.0482 -27.7984 -26.0478 -24.8631 -24.3438 -24.1824 -23.7787 -23.2272 -21.7370 -21.5376 -21.2859 -20.7342 -20.3452 -20.0181 -19.4192 -18.6957 -18.6373 -18.4101 -18.1844 -17.8687 -17.6370 -16.8968 -16.5221 -16.4103 -15.9184 -15.6042 -15.4214 -13.3377 -12.2080 -2.3327 -2.1341 -1.8871 -1.4504 -0.6609 -0.5705 -0.0392 0.1742 0.3845 0.8184 0.9232 electronvolt
chargesum: 1.0000000
charge: -0.131930 -0.173873 -0.004846 -0.234442 -0.134807 0.199753 0.121453 0.141766 0.163334 0.151898 -0.263368 0.220316 -0.209908 0.140373 0.153758 0.014666 0.159445 0.288624 -0.231644 0.260913 0.240320 0.237025 -0.047815 -0.296169 0.235160
charge: -0.001861 -0.000133 -0.122076 -0.021379 0.010467 -0.188131 0.025716 0.029444 0.026203 0.033924 0.377880 -0.098794 0.008373 0.043437 0.049235 -0.038003 0.044073 -0.441582 0.412337 -0.057491 0.056142 0.044826 0.622782 0.138985 0.045626
qa: -0.1319 -0.1739 -0.0048 -0.2344 -0.1348 0.1998 0.1215 0.1418 0.1633 0.1519 -0.2634 0.2203 -0.2099 0.1404 0.1538 0.0147 0.1594 0.2886 -0.2316 0.2609 0.2403 0.2370 -0.0478 -0.2962 0.2352
va: 3.9479 4.0535 3.5438 3.9663 4.0131 4.0958 1.0063 1.0032 0.9964 1.0064 2.2403 1.0238 3.8594 1.0064 1.0098 3.8032 1.0039 4.3701 2.2898 0.9993 0.9716 1.0075 3.6421 2.1926 1.0088
dispersion: -0.050683036 hartree
energy: -630.879060960414 hartree
dipole: -0.406326258 -1.415336373 -1.821662631 -0.604652497 0.872918726 0.268266228 0.948165311 -0.090414040 0.857751272
dipolemethod: SCF
magnitude: 2.031294847 au
magnitude: 5.163141180 debye
temp: 298.15 k
press: 1.00 atm
zeropoint: 0.21066346 hartree
thermalvibcorrection: 0.00931556 hartree
thermalrotcorrection: 0.00141627 hartree
thermaltrasncorrection: 0.00141627 hartree
thermaltotal: -630.65624940 hartree
thermalcorr: 0.01214810 hartree
nonthermalcorr: 0.21066346 hartree
totalcorr: 0.22281156 hartree
thermalcorrenthalpy: 0.00094421 hartree
totalenthalpy: -630.65530519 hartree
vibrat: 0.01594917 hartree
rotat: 0.01494192 hartree
transl: 0.01972090 hartree
total: 0.05061200 hartree
totalentropycorr: -0.05061200 hartree
gibbsenthalpy: -630.70591719 hartree
gibbsminuselec: 0.17314377 hartree
