program: Orca
programVersion: 6.0.0
elementType: C C C C C C H H H H O H C H H C H C O H H H N O H
charge: 1
multiplicity: 1
keywords: wB97X-D3BJ TightOpt Freq def2-TZVPP def2/J RIJCOSX TightSCF defgrid3 CHELPG
frequency: 0.00 0.00 0.00 0.00 0.00 0.00 28.10 43.56 66.73 103.94 148.00 164.58 178.07 225.17 302.42 314.19 359.34 400.04 427.21 433.28 466.07 500.93 560.40 602.73 639.00 648.10 684.93 702.77 726.56 770.34 809.78 830.17 851.11 863.52 911.13 942.10 995.24 1016.76 1023.90 1028.38 1063.95 1108.55 1126.56 1144.31 1178.74 1205.70 1211.48 1245.63 1254.33 1285.93 1336.82 1344.03 1349.69 1394.96 1457.89 1473.47 1503.82 1545.21 1651.07 1655.00 1664.91 1710.44 1854.46 3073.20 3105.42 3158.80 3217.38 3226.28 3243.63 3257.12 3562.53 3650.25 3699.32 3777.27 3804.71
frequency: 28.10 43.56 66.73 103.94 148.00 164.58 178.07 225.17 302.42 314.19 359.34 400.04 427.21 433.28 466.07 500.93 560.40 602.73 639.00 648.10 684.93 702.77 726.56 770.34 809.78 830.17 851.11 863.52 911.13 942.10 995.24 1016.76 1023.90 1028.38 1063.95 1108.55 1126.56 1144.31 1178.74 1205.70 1211.48 1245.63 1254.33 1285.93 1336.82 1344.03 1349.69 1394.96 1457.89 1473.47 1503.82 1545.21 1651.07 1655.00 1664.91 1710.44 1854.46 3073.20 3105.42 3158.80 3217.38 3226.28 3243.63 3257.12 3562.53 3650.25 3699.32 3777.27 3804.71
formula: C9H12NO3
InChI: InChI=1/C9H12NO3/c10-8(9(12)13)5-6-1-3-7(11)4-2-6/h1-4,8,12H,5,10-11H2
25 atoms
C  2.25263 1.107909 0.406645
C  1.325624 0.256049 0.989001
C  0.646729 -0.697259 0.224788
C  0.915534 -0.798416 -1.139504
C  1.839341 0.036821 -1.757292
C  2.456358 0.951738 -0.944433
H  2.777698 1.853614 0.992157
H  1.108325 0.343434 2.043969
H  0.392899 -1.536799 -1.734766
H  2.058692 -0.027693 -2.814904
O  3.44086 1.85444 -1.620814
H  3.169624 2.787585 -1.622992
C  -0.409967 -1.562231 0.855995
H  -0.595238 -2.442073 0.240071
H  -0.080167 -1.899629 1.839207
C  -1.733818 -0.781585 1.059894
H  -2.484398 -1.508914 1.385795
C  -2.22148 -0.236274 -0.272584
O  -2.434923 -1.217687 -1.167649
H  -2.781909 -0.808284 -1.97152
H  -2.00376 0.095532 2.892257
H  -1.969851 1.156044 1.640101
N  -1.563837 0.304931 2.008205
O  -2.386587 0.92798 -0.520147
H  4.348117 1.760569 -1.286171
totalener: -630.75289549811339 hartree
nucrepener: 817.45814910650938 hartree
electener: -1448.21104694907126 hartree
oneelecener: -2465.74838428316434 hartree
twoeener: 1017.53733733409319 hartree
kineticenergy: 628.22719429927452 hartree
exchangeener: -55.761578466082 hartree
correlationener: -4.053541634157 hartree
xcener: -59.815120100239 hartree
dispersion: -0.051985560 hartree
dispersion: -0.050742998 hartree
dispersion: -0.050826496 hartree
dispersion: -0.050932994 hartree
dispersion: -0.050972377 hartree
dispersion: -0.051070845 hartree
dispersion: -0.051045058 hartree
dispersion: -0.051021044 hartree
dispersion: -0.051003274 hartree
dispersion: -0.050950163 hartree
dispersion: -0.050878275 hartree
dispersion: -0.050764188 hartree
dispersion: -0.050715237 hartree
dispersion: -0.051113902 hartree
dispersion: -0.051004096 hartree
dispersion: -0.050916860 hartree
dispersion: -0.050835195 hartree
dispersion: -0.050713377 hartree
dispersion: -0.050814313 hartree
dispersion: -0.050810593 hartree
dispersion: -0.050814636 hartree
dispersion: -0.050809987 hartree
dispersion: -0.050809107 hartree
dispersion: -0.050807696 hartree
dispersion: -0.050806328 hartree
dispersion: -0.050806727 hartree
dispersion: -0.050807595 hartree
dispersion: -0.050807559 hartree
energy: -532.3766 -527.1280 -525.5814 -394.4935 -286.3646 -286.1185 -284.3225 -284.2620 -283.9111 -283.8633 -283.7884 -283.7244 -282.9533 -40.6873 -36.9041 -34.3830 -31.9155 -31.0183 -29.2135 -28.6213 -27.2797 -26.6210 -25.6939 -24.7483 -24.2835 -22.9846 -22.2988 -21.5170 -20.8768 -19.9947 -19.7935 -19.5155 -19.3440 -19.1172 -18.9354 -18.2982 -17.9718 -17.6920 -17.1860 -16.7626 -16.5783 -16.2050 -15.8247 -14.8065 -13.9404 -13.8059 -13.4984 -12.5682 -3.1684 -2.6313 -2.4425 -0.9515 -0.6086 -0.4114 0.2534 0.6029 0.8561 1.3261 1.4351 electronvolt
chargesum: 1.0000000
charge: -0.131419 -0.113164 0.045557 -0.103023 -0.139232 0.115412 0.149478 0.135696 0.149908 0.171290 -0.033184 0.301076 -0.119766 0.121128 0.113500 0.068544 0.124076 0.256603 -0.270433 0.235320 0.170234 0.172450 -0.413692 -0.306349 0.299990
charge: -0.002715 0.053647 -0.036263 0.041666 0.013191 -0.104105 0.032456 0.035850 0.037004 0.038085 0.738838 0.008278 0.011640 0.035763 0.037724 -0.128470 0.035354 -0.428014 0.367334 -0.085628 -0.050124 -0.050630 0.269120 0.122776 0.007221
qa: -0.1314 -0.1132 0.0456 -0.1030 -0.1392 0.1154 0.1495 0.1357 0.1499 0.1713 -0.0332 0.3011 -0.1198 0.1211 0.1135 0.0685 0.1241 0.2566 -0.2704 0.2353 0.1702 0.1724 -0.4137 -0.3063 0.3000
va: 4.0955 4.0976 3.7397 4.0277 4.0984 3.6794 0.9988 1.0513 1.0093 0.9951 2.6214 0.9615 3.7446 1.0180 1.0133 3.9414 1.0055 4.3626 2.2052 1.0208 1.0121 1.0338 3.0251 2.1952 0.9632
dispersion: -0.050806823 hartree
energy: -630.811450066017 hartree
dipole: 2.371204140 1.593417481 3.964621622 -0.707815575 2.394426816 1.686611241 3.335936726 -4.432805899 -1.096869173
dipolemethod: SCF
magnitude: 4.445897442 au
magnitude: 11.300573227 debye
temp: 298.15 k
press: 1.00 atm
zeropoint: 0.20802267 hartree
thermalvibcorrection: 0.00995639 hartree
thermalrotcorrection: 0.00141627 hartree
thermaltrasncorrection: 0.00141627 hartree
thermaltotal: -630.59063846 hartree
thermalcorr: 0.01278893 hartree
nonthermalcorr: 0.20802267 hartree
totalcorr: 0.22081161 hartree
thermalcorrenthalpy: 0.00094421 hartree
totalenthalpy: -630.58969425 hartree
vibrat: 0.01737951 hartree
rotat: 0.01486154 hartree
transl: 0.01972090 hartree
total: 0.05196195 hartree
totalentropycorr: -0.05196195 hartree
gibbsenthalpy: -630.64165620 hartree
gibbsminuselec: 0.16979387 hartree
