program: Orca
programVersion: 6.0.0
elementType: C C C C C C H H H H O H C H H C H C O H H H N O H
charge: 1
multiplicity: 1
keywords: wB97X-D3BJ TightOpt Freq def2-TZVPP def2/J RIJCOSX TightSCF defgrid3 CHELPG
frequency: 0.00 0.00 0.00 0.00 0.00 0.00 17.27 32.26 54.34 69.57 145.02 181.32 201.82 263.29 288.10 310.59 340.35 381.76 425.36 428.80 470.94 516.74 523.28 598.81 639.32 650.04 685.25 703.84 733.32 751.99 829.04 834.92 849.32 886.12 911.39 958.76 998.06 1018.35 1023.96 1028.07 1063.36 1108.29 1128.61 1158.74 1175.63 1205.59 1209.07 1251.22 1288.53 1304.41 1341.48 1352.18 1378.45 1397.18 1417.33 1471.35 1509.66 1545.55 1651.52 1664.21 1681.34 1710.16 1849.87 3072.21 3088.96 3161.08 3217.05 3220.63 3242.38 3253.43 3553.05 3628.84 3699.98 3777.90 3798.53
frequency: 17.27 32.26 54.34 69.57 145.02 181.32 201.82 263.29 288.10 310.59 340.35 381.76 425.36 428.80 470.94 516.74 523.28 598.81 639.32 650.04 685.25 703.84 733.32 751.99 829.04 834.92 849.32 886.12 911.39 958.76 998.06 1018.35 1023.96 1028.07 1063.36 1108.29 1128.61 1158.74 1175.63 1205.59 1209.07 1251.22 1288.53 1304.41 1341.48 1352.18 1378.45 1397.18 1417.33 1471.35 1509.66 1545.55 1651.52 1664.21 1681.34 1710.16 1849.87 3072.21 3088.96 3161.08 3217.05 3220.63 3242.38 3253.43 3553.05 3628.84 3699.98 3777.90 3798.53
formula: C9H12NO3
InChI: InChI=1/C9H12NO3/c10-8(9(12)13)5-6-1-3-7(11)4-2-6/h1-4,8,12H,5,10-11H2
25 atoms
C  2.100822 1.76834 -0.079268
C  0.771319 1.372698 -0.107349
C  0.397544 0.144919 -0.659404
C  1.378929 -0.694326 -1.185473
C  2.721333 -0.33339 -1.173981
C  3.008629 0.886268 -0.617633
H  2.396329 2.720367 0.346127
H  0.015908 2.019172 0.316795
H  1.095002 -1.647157 -1.61599
H  3.493718 -0.972561 -1.581286
O  4.455939 1.268975 -0.615304
H  4.653612 2.045121 -1.165394
C  -1.041501 -0.293276 -0.660546
H  -1.689012 0.54978 -0.915852
H  -1.196648 -1.068142 -1.409754
C  -1.467072 -0.840604 0.713821
H  -0.704831 -1.554532 1.043786
C  -2.729774 -1.690893 0.530102
O  -3.659148 -1.457923 1.470554
H  -4.401856 -2.052037 1.295496
H  -1.599543 -0.143888 2.629333
H  -2.365869 0.787527 1.548673
N  -1.532803 0.229061 1.691727
O  -2.862918 -2.498257 -0.34969
H  4.828388 1.374563 0.275817
totalener: -630.75091695745550 hartree
nucrepener: 778.36948713048298 hartree
electener: -1409.12040342697264 hartree
oneelecener: -2387.82491356191576 hartree
twoeener: 978.70451013494312 hartree
kineticenergy: 628.20692351175273 hartree
exchangeener: -55.757679399239 hartree
correlationener: -4.051699698930 hartree
xcener: -59.809379098168 hartree
dispersion: -0.049730684 hartree
dispersion: -0.049265973 hartree
dispersion: -0.049316464 hartree
dispersion: -0.049405565 hartree
dispersion: -0.049354909 hartree
dispersion: -0.049353704 hartree
dispersion: -0.049353641 hartree
dispersion: -0.049352308 hartree
dispersion: -0.049341700 hartree
dispersion: -0.049322770 hartree
dispersion: -0.049357517 hartree
dispersion: -0.049289665 hartree
dispersion: -0.049343639 hartree
dispersion: -0.049313547 hartree
dispersion: -0.049256164 hartree
dispersion: -0.049245694 hartree
dispersion: -0.049234617 hartree
dispersion: -0.049187327 hartree
dispersion: -0.049136266 hartree
dispersion: -0.049082514 hartree
dispersion: -0.049250351 hartree
dispersion: -0.049139344 hartree
dispersion: -0.049150177 hartree
dispersion: -0.049196520 hartree
dispersion: -0.049270428 hartree
dispersion: -0.049298790 hartree
dispersion: -0.049262438 hartree
dispersion: -0.049213524 hartree
dispersion: -0.049169025 hartree
dispersion: -0.049149744 hartree
dispersion: -0.049143864 hartree
dispersion: -0.049144592 hartree
dispersion: -0.049144969 hartree
dispersion: -0.049145045 hartree
dispersion: -0.049143956 hartree
dispersion: -0.049142658 hartree
dispersion: -0.049142701 hartree
dispersion: -0.049143783 hartree
dispersion: -0.049144728 hartree
energy: -532.4253 -526.8083 -525.1208 -394.6568 -286.4119 -285.7395 -284.3864 -284.3084 -283.9622 -283.8214 -283.8193 -283.7936 -282.8991 -40.7354 -36.5400 -33.9780 -31.9608 -31.1221 -29.2456 -28.6704 -27.2095 -26.6716 -25.6123 -24.7895 -24.1767 -23.0324 -22.4303 -21.5588 -20.7070 -20.0273 -19.6413 -19.5294 -19.0790 -19.0565 -18.9406 -18.2603 -18.0413 -17.5727 -16.9306 -16.7311 -16.2340 -16.0362 -15.7395 -14.3490 -14.1151 -13.9105 -13.7052 -12.2976 -3.2197 -2.6730 -2.4813 -1.0014 -0.6477 -0.2459 0.4333 0.5676 1.0254 1.2809 1.3630 electronvolt
chargesum: 1.0000000
charge: -0.130519 -0.114770 0.067583 -0.103503 -0.142213 0.113386 0.149610 0.130530 0.154427 0.172493 -0.032751 0.300595 -0.165125 0.114465 0.129286 0.068138 0.102682 0.261165 -0.269945 0.238855 0.165333 0.159837 -0.368440 -0.301485 0.300365
charge: -0.003649 0.051152 -0.033415 0.045226 0.013295 -0.106154 0.032388 0.036217 0.040512 0.038772 0.739124 0.007737 0.013146 0.037318 0.039560 -0.137903 0.040746 -0.431380 0.359965 -0.081310 -0.044703 -0.045836 0.261509 0.120160 0.007523
qa: -0.1305 -0.1148 0.0676 -0.1035 -0.1422 0.1134 0.1496 0.1305 0.1544 0.1725 -0.0328 0.3006 -0.1651 0.1145 0.1293 0.0681 0.1027 0.2612 -0.2699 0.2389 0.1653 0.1598 -0.3684 -0.3015 0.3004
va: 4.0859 4.0992 3.6823 4.0219 4.0811 3.6597 0.9988 1.0404 0.9993 0.9950 2.6212 0.9622 3.8384 1.0062 1.0335 3.8716 1.0103 4.3536 2.2194 1.0193 1.0220 1.0215 3.0695 2.1963 0.9626
dispersion: -0.049144745 hartree
energy: -630.807857577747 hartree
dipole: 3.475647720 1.647200004 5.122847724 3.994537604 -1.378877305 2.615660299 1.131435340 -1.164073192 -0.032637852
dipolemethod: SCF
magnitude: 5.752070308 au
magnitude: 14.620600805 debye
temp: 298.15 k
press: 1.00 atm
zeropoint: 0.20806317 hartree
thermalvibcorrection: 0.01004384 hartree
thermalrotcorrection: 0.00141627 hartree
thermaltrasncorrection: 0.00141627 hartree
thermaltotal: -630.58691802 hartree
thermalcorr: 0.01287639 hartree
nonthermalcorr: 0.20806317 hartree
totalcorr: 0.22093956 hartree
thermalcorrenthalpy: 0.00094421 hartree
totalenthalpy: -630.58597381 hartree
vibrat: 0.01775103 hartree
rotat: 0.01499583 hartree
transl: 0.01972090 hartree
total: 0.05246776 hartree
totalentropycorr: -0.05246776 hartree
gibbsenthalpy: -630.63844157 hartree
gibbsminuselec: 0.16941600 hartree
