program: Orca
programVersion: 6.0.0
elementType: C C C C C C H H H H O H C H H C H C O H H H N O H
charge: 1
multiplicity: 1
keywords: wB97X-D3BJ TightOpt Freq def2-TZVPP def2/J RIJCOSX TightSCF defgrid3 CHELPG
frequency: 0.00 0.00 0.00 0.00 0.00 0.00 34.65 44.22 73.32 88.79 147.03 163.09 239.02 263.22 291.62 317.80 337.18 347.82 399.73 427.42 472.45 514.51 557.91 582.57 621.45 639.99 690.87 708.03 740.09 760.27 804.02 833.38 841.58 854.14 889.34 978.60 996.70 1019.52 1028.11 1054.10 1064.17 1109.10 1133.26 1143.32 1182.08 1205.98 1210.43 1246.99 1262.30 1320.44 1339.09 1344.71 1349.13 1400.48 1463.35 1475.13 1496.82 1546.23 1651.86 1664.95 1667.05 1711.13 1848.10 2982.29 3088.09 3156.57 3216.41 3217.78 3242.34 3251.36 3563.73 3645.19 3698.93 3776.29 3806.00
frequency: 34.65 44.22 73.32 88.79 147.03 163.09 239.02 263.22 291.62 317.80 337.18 347.82 399.73 427.42 472.45 514.51 557.91 582.57 621.45 639.99 690.87 708.03 740.09 760.27 804.02 833.38 841.58 854.14 889.34 978.60 996.70 1019.52 1028.11 1054.10 1064.17 1109.10 1133.26 1143.32 1182.08 1205.98 1210.43 1246.99 1262.30 1320.44 1339.09 1344.71 1349.13 1400.48 1463.35 1475.13 1496.82 1546.23 1651.86 1664.95 1667.05 1711.13 1848.10 2982.29 3088.09 3156.57 3216.41 3217.78 3242.34 3251.36 3563.73 3645.19 3698.93 3776.29 3806.00
formula: C9H12NO3
InChI: InChI=1/C9H12NO3/c10-8(9(12)13)5-6-1-3-7(11)4-2-6/h1-4,8,12H,5,10-11H2
25 atoms
C  2.311637 1.499375 -0.013706
C  1.322263 0.884098 0.738538
C  0.780045 -0.342544 0.351191
C  1.243992 -0.955193 -0.812401
C  2.229814 -0.367659 -1.596714
C  2.711579 0.835743 -1.149893
H  2.732319 2.453133 0.282912
H  0.950306 1.373218 1.628066
H  0.837732 -1.912614 -1.116759
H  2.600088 -0.831456 -2.50154
O  3.773806 1.461599 -1.99887
H  3.506681 2.310664 -2.388708
C  -0.294759 -1.001951 1.176946
H  -0.038358 -2.056004 1.311067
H  -0.346448 -0.551407 2.16731
C  -1.688918 -0.942889 0.543413
H  -1.621405 -1.249942 -0.513224
C  -2.2161 0.485782 0.526918
O  -3.479052 0.531762 0.077882
H  -3.77618 1.450822 0.112105
H  -2.349146 -2.737223 1.277829
H  -3.553581 -1.667343 0.991306
N  -2.60448 -1.759915 1.327736
O  -1.595995 1.464489 0.852228
H  4.630658 1.545261 -1.548325
totalener: -630.74831617092332 hartree
nucrepener: 806.02799690389429 hartree
electener: -1436.77630956800704 hartree
oneelecener: -2443.15434032185385 hartree
twoeener: 1006.37803075384693 hartree
kineticenergy: 628.22517658197239 hartree
exchangeener: -55.762256664201 hartree
correlationener: -4.053051409686 hartree
xcener: -59.815308073887 hartree
dispersion: -0.050775670 hartree
dispersion: -0.049566291 hartree
dispersion: -0.049760092 hartree
dispersion: -0.050041136 hartree
dispersion: -0.049887372 hartree
dispersion: -0.049798827 hartree
dispersion: -0.049630040 hartree
dispersion: -0.049592133 hartree
dispersion: -0.049701177 hartree
dispersion: -0.049768300 hartree
dispersion: -0.049804197 hartree
dispersion: -0.049816173 hartree
dispersion: -0.049843876 hartree
dispersion: -0.049794199 hartree
dispersion: -0.049762338 hartree
dispersion: -0.049716141 hartree
dispersion: -0.049754144 hartree
dispersion: -0.049762959 hartree
dispersion: -0.049760914 hartree
dispersion: -0.049741961 hartree
dispersion: -0.049735501 hartree
dispersion: -0.049731313 hartree
dispersion: -0.049730676 hartree
energy: -532.4187 -526.9418 -525.4320 -394.4581 -286.4018 -286.0087 -284.3553 -284.3214 -283.9736 -283.8548 -283.8137 -283.7660 -282.8838 -40.7290 -36.7497 -34.2137 -31.9459 -30.9844 -29.2667 -28.6671 -27.1523 -26.6588 -25.6082 -24.8199 -24.4211 -23.0541 -22.2247 -21.5511 -20.5512 -20.2201 -19.5999 -19.5530 -19.3047 -19.0981 -18.7470 -18.3793 -18.0777 -17.5528 -17.1713 -16.7747 -16.3672 -16.1371 -15.8900 -14.6545 -13.9946 -13.8990 -13.3024 -12.3930 -3.2058 -2.6947 -2.4358 -0.9953 -0.6554 -0.3968 0.4151 0.6405 0.8728 1.2606 1.3783 electronvolt
chargesum: 1.0000000
charge: -0.136120 -0.065219 0.015772 -0.119758 -0.154183 0.118365 0.150488 0.148888 0.148713 0.171270 -0.032907 0.300784 -0.143054 0.111461 0.124378 0.087332 0.105162 0.282193 -0.269508 0.236868 0.149086 0.164363 -0.368759 -0.326130 0.300512
charge: -0.001552 0.055005 -0.033682 0.038760 0.011998 -0.105743 0.033164 0.041785 0.037464 0.038193 0.738810 0.008006 0.010989 0.037128 0.043109 -0.140690 0.021628 -0.414072 0.371246 -0.082559 -0.049048 -0.046865 0.259855 0.119230 0.007841
qa: -0.1361 -0.0652 0.0158 -0.1198 -0.1542 0.1184 0.1505 0.1489 0.1487 0.1713 -0.0329 0.3008 -0.1431 0.1115 0.1244 0.0873 0.1052 0.2822 -0.2695 0.2369 0.1491 0.1644 -0.3688 -0.3261 0.3005
va: 4.0923 4.0499 3.7469 4.0422 4.1067 3.6565 0.9988 1.0163 0.9981 0.9955 2.6211 0.9621 3.7887 1.0101 1.0260 3.8281 1.0115 4.3404 2.2235 1.0207 1.0216 1.0248 3.0148 2.1544 0.9624
dispersion: -0.049731103 hartree
energy: -630.807125340836 hartree
dipole: 1.880382878 2.449568243 4.329951122 -3.572691370 4.860795801 1.288104431 -0.186688415 -2.405382694 -2.592071109
dipolemethod: SCF
magnitude: 5.208312815 au
magnitude: 13.238479096 debye
temp: 298.15 k
press: 1.00 atm
zeropoint: 0.20786821 hartree
thermalvibcorrection: 0.00993300 hartree
thermalrotcorrection: 0.00141627 hartree
thermaltrasncorrection: 0.00141627 hartree
thermaltotal: -630.58649159 hartree
thermalcorr: 0.01276554 hartree
nonthermalcorr: 0.20786821 hartree
totalcorr: 0.22063375 hartree
thermalcorrenthalpy: 0.00094421 hartree
totalenthalpy: -630.58554738 hartree
vibrat: 0.01717053 hartree
rotat: 0.01495166 hartree
transl: 0.01972090 hartree
total: 0.05184309 hartree
totalentropycorr: -0.05184309 hartree
gibbsenthalpy: -630.63739047 hartree
gibbsminuselec: 0.16973487 hartree
