program: Orca
programVersion: 6.0.0
elementType: C C C C C C H H H H O H C H H C H C O H H H N O H
charge: 1
multiplicity: 1
keywords: wB97X-D3BJ TightOpt Freq def2-TZVPP def2/J RIJCOSX TightSCF defgrid3 CHELPG
frequency: 0.00 0.00 0.00 0.00 0.00 0.00 40.12 48.01 85.64 111.65 149.00 174.37 214.80 309.26 318.64 330.65 362.85 408.17 422.81 432.81 475.93 526.26 554.85 601.37 640.22 683.42 703.29 733.08 776.17 797.33 818.38 831.66 843.88 858.07 891.93 925.00 1000.84 1026.49 1031.64 1050.16 1067.60 1110.69 1119.79 1139.91 1180.33 1208.50 1236.93 1241.20 1253.69 1303.10 1340.34 1351.09 1381.61 1409.92 1433.00 1473.16 1497.35 1544.81 1652.26 1664.36 1668.09 1708.45 1862.28 3092.62 3102.71 3159.24 3216.79 3217.96 3242.11 3248.52 3566.74 3615.72 3655.56 3694.51 3771.17
frequency: 40.12 48.01 85.64 111.65 149.00 174.37 214.80 309.26 318.64 330.65 362.85 408.17 422.81 432.81 475.93 526.26 554.85 601.37 640.22 683.42 703.29 733.08 776.17 797.33 818.38 831.66 843.88 858.07 891.93 925.00 1000.84 1026.49 1031.64 1050.16 1067.60 1110.69 1119.79 1139.91 1180.33 1208.50 1236.93 1241.20 1253.69 1303.10 1340.34 1351.09 1381.61 1409.92 1433.00 1473.16 1497.35 1544.81 1652.26 1664.36 1668.09 1708.45 1862.28 3092.62 3102.71 3159.24 3216.79 3217.96 3242.11 3248.52 3566.74 3615.72 3655.56 3694.51 3771.17
formula: C9H12NO3
InChI: InChI=1/C9H12NO3/c10-8(9(12)13)5-6-1-3-7(11)4-2-6/h1-4,8,12H,5,10-11H2
25 atoms
C  2.245863 1.230822 0.574553
C  1.320211 0.331509 1.094705
C  0.684044 -0.607929 0.282753
C  0.996288 -0.654884 -1.080605
C  1.91609 0.223609 -1.632893
C  2.491311 1.127332 -0.77003
H  2.748722 1.962789 1.192938
H  1.108287 0.357296 2.157057
H  0.50139 -1.378783 -1.713804
H  2.159001 0.189274 -2.688664
O  3.490798 2.09463 -1.320567
H  4.297924 1.669847 -1.65678
C  -0.336972 -1.555233 0.859498
H  -0.296682 -2.502775 0.323373
H  -0.105779 -1.750733 1.908141
C  -1.781815 -1.023994 0.774644
H  -2.432839 -1.805235 1.177299
C  -2.222531 -0.869018 -0.691898
O  -3.103727 0.10315 -0.90081
H  -3.23883 0.54307 -0.040429
H  -2.271822 0.031986 2.484201
H  -1.332242 0.885109 1.439187
N  -2.073277 0.200451 1.508851
O  -1.816536 -1.582284 -1.570828
H  3.119621 2.699794 -1.984586
totalener: -630.75065918186317 hartree
nucrepener: 810.86301169380249 hartree
electener: -1441.61367350438650 hartree
oneelecener: -2452.23340025573998 hartree
twoeener: 1010.61972675135360 hartree
kineticenergy: 628.21701778600277 hartree
exchangeener: -55.762161500819 hartree
correlationener: -4.055205022779 hartree
xcener: -59.817366523598 hartree
dispersion: -0.051693488 hartree
dispersion: -0.050888893 hartree
dispersion: -0.050897874 hartree
dispersion: -0.051108585 hartree
dispersion: -0.051080862 hartree
dispersion: -0.051059629 hartree
dispersion: -0.051031478 hartree
dispersion: -0.051017379 hartree
dispersion: -0.051015783 hartree
dispersion: -0.051052868 hartree
dispersion: -0.051068246 hartree
dispersion: -0.051072158 hartree
dispersion: -0.051069097 hartree
dispersion: -0.051062929 hartree
dispersion: -0.051055019 hartree
dispersion: -0.051045376 hartree
dispersion: -0.051040561 hartree
dispersion: -0.051038664 hartree
energy: -532.5886 -526.5020 -524.9992 -395.3948 -286.6315 -285.7076 -284.5671 -284.5647 -284.2267 -284.1213 -284.0911 -283.9373 -283.1649 -40.8995 -36.3522 -34.0139 -32.1893 -31.5670 -29.4911 -28.8850 -27.4677 -26.8202 -25.7627 -25.0338 -24.1884 -23.2428 -22.3107 -21.7877 -21.2453 -20.4244 -20.0549 -19.6765 -19.4380 -19.2982 -18.9325 -18.3573 -18.0994 -17.6868 -17.2894 -17.1967 -16.6838 -15.9547 -15.7020 -14.3254 -14.1830 -14.0701 -13.7183 -12.7756 -3.3386 -2.9216 -2.7395 -1.1358 -0.8008 -0.5947 0.2254 0.5510 0.7311 1.1611 1.2824 electronvolt
chargesum: 1.0000000
charge: -0.126657 -0.193465 0.054533 -0.124876 -0.116482 0.105949 0.175263 0.159130 0.177178 0.156577 -0.032236 0.302225 -0.153104 0.138195 0.111565 0.037031 0.121717 0.292354 -0.228525 0.232800 0.180431 0.162685 -0.410460 -0.324201 0.302374
charge: 0.013276 0.027793 -0.039899 0.060326 0.002490 -0.103997 0.039166 0.035289 0.041586 0.035596 0.739507 0.009522 0.008945 0.045593 0.034370 -0.129196 0.045317 -0.443182 0.382455 -0.123200 -0.043387 -0.052535 0.287406 0.117211 0.009548
qa: -0.1267 -0.1935 0.0545 -0.1249 -0.1165 0.1059 0.1753 0.1591 0.1772 0.1566 -0.0322 0.3022 -0.1531 0.1382 0.1116 0.0370 0.1217 0.2924 -0.2285 0.2328 0.1804 0.1627 -0.4105 -0.3242 0.3024
va: 4.0843 4.0683 3.6949 4.0514 4.0737 3.6874 0.9936 1.0015 1.0167 0.9972 2.6224 0.9609 3.8720 1.0104 1.0039 3.8618 0.9998 4.3496 2.2474 1.0405 1.0100 1.0291 3.0376 2.1731 0.9609
dispersion: -0.051038608 hartree
energy: -630.807796860755 hartree
dipole: 2.956291199 1.798974143 4.755265343 1.354434054 1.433561194 2.787995248 5.120114678 -4.961497395 0.158617283
dipolemethod: SCF
magnitude: 5.514582978 au
magnitude: 14.016955985 debye
temp: 298.15 k
press: 1.00 atm
zeropoint: 0.20870490 hartree
thermalvibcorrection: 0.00954846 hartree
thermalrotcorrection: 0.00141627 hartree
thermaltrasncorrection: 0.00141627 hartree
thermaltotal: -630.58671096 hartree
thermalcorr: 0.01238100 hartree
nonthermalcorr: 0.20870490 hartree
totalcorr: 0.22108590 hartree
thermalcorrenthalpy: 0.00094421 hartree
totalenthalpy: -630.58576675 hartree
vibrat: 0.01638951 hartree
rotat: 0.01490787 hartree
transl: 0.01972090 hartree
total: 0.05101828 hartree
totalentropycorr: -0.05101828 hartree
gibbsenthalpy: -630.63678504 hartree
gibbsminuselec: 0.17101182 hartree
