program: Orca
programVersion: 6.0.0
elementType: C C C C C C H H H H O H C H H C H C O H H H N O H
charge: 1
multiplicity: 1
keywords: wB97X-D3BJ TightOpt Freq def2-TZVPP def2/J RIJCOSX TightSCF defgrid3 CHELPG
frequency: 0.00 0.00 0.00 0.00 0.00 0.00 32.70 58.25 63.85 98.02 142.19 161.50 196.61 216.21 299.12 306.98 357.02 393.79 419.17 430.61 461.43 496.47 517.32 578.34 639.52 658.72 681.92 703.36 727.29 787.75 808.90 832.78 849.95 887.46 897.47 938.65 996.57 1019.36 1024.89 1029.45 1064.50 1109.63 1135.01 1148.58 1164.16 1207.53 1210.46 1236.08 1249.76 1273.11 1327.24 1340.26 1351.79 1389.73 1448.29 1476.00 1498.96 1546.72 1651.00 1667.79 1671.80 1711.33 1871.85 3087.02 3097.77 3153.06 3217.60 3222.35 3244.40 3246.35 3547.75 3635.74 3698.89 3777.66 3856.34
frequency: 32.70 58.25 63.85 98.02 142.19 161.50 196.61 216.21 299.12 306.98 357.02 393.79 419.17 430.61 461.43 496.47 517.32 578.34 639.52 658.72 681.92 703.36 727.29 787.75 808.90 832.78 849.95 887.46 897.47 938.65 996.57 1019.36 1024.89 1029.45 1064.50 1109.63 1135.01 1148.58 1164.16 1207.53 1210.46 1236.08 1249.76 1273.11 1327.24 1340.26 1351.79 1389.73 1448.29 1476.00 1498.96 1546.72 1651.00 1667.79 1671.80 1711.33 1871.85 3087.02 3097.77 3153.06 3217.60 3222.35 3244.40 3246.35 3547.75 3635.74 3698.89 3777.66 3856.34
formula: C9H12NO3
InChI: InChI=1/C9H12NO3/c10-8(9(12)13)5-6-1-3-7(11)4-2-6/h1-4,8,12H,5,10-11H2
25 atoms
C  2.34716 1.006365 0.489375
C  1.398606 0.141888 1.017903
C  0.634764 -0.678306 0.18561
C  0.837871 -0.638764 -1.19291
C  1.780168 0.210546 -1.757489
C  2.482981 0.993954 -0.878821
H  2.937619 1.65334 1.12756
H  1.232199 0.120019 2.086436
H  0.242514 -1.266098 -1.845265
H  1.944055 0.259804 -2.825821
O  3.481111 1.919095 -1.500212
H  3.233832 2.856649 -1.434029
C  -0.452888 -1.540096 0.767618
H  -0.626814 -2.403798 0.122229
H  -0.158883 -1.906635 1.750686
C  -1.767793 -0.733625 0.957237
H  -2.513429 -1.421357 1.365317
C  -2.218703 -0.244827 -0.421572
O  -2.781443 -1.159542 -1.234737
H  -2.974396 -1.97602 -0.76309
H  -1.456793 1.226613 1.349357
H  -2.359824 0.486767 2.486327
N  -1.561784 0.367974 1.878317
O  -2.004963 0.867519 -0.813409
H  4.391329 1.778338 -1.19131
totalener: -630.74403725737352 hartree
nucrepener: 823.29858299471471 hartree
electener: -1454.04262399382583 hartree
oneelecener: -2477.19669682778795 hartree
twoeener: 1023.15407283396212 hartree
kineticenergy: 628.20666207782097 hartree
exchangeener: -55.757480938126 hartree
correlationener: -4.054081342147 hartree
xcener: -59.811562280274 hartree
dispersion: -0.052735943 hartree
dispersion: -0.051287348 hartree
dispersion: -0.051441036 hartree
dispersion: -0.051537604 hartree
dispersion: -0.051632024 hartree
dispersion: -0.051569039 hartree
dispersion: -0.051579057 hartree
dispersion: -0.051599641 hartree
dispersion: -0.051602796 hartree
dispersion: -0.051598680 hartree
dispersion: -0.051592149 hartree
dispersion: -0.051588632 hartree
dispersion: -0.051585884 hartree
dispersion: -0.051583581 hartree
dispersion: -0.051583293 hartree
dispersion: -0.051582677 hartree
dispersion: -0.051582245 hartree
dispersion: -0.051581340 hartree
dispersion: -0.051580314 hartree
dispersion: -0.051578741 hartree
dispersion: -0.051577259 hartree
dispersion: -0.051575764 hartree
dispersion: -0.051573589 hartree
dispersion: -0.051571735 hartree
dispersion: -0.051569281 hartree
dispersion: -0.051567228 hartree
dispersion: -0.051564784 hartree
dispersion: -0.051562173 hartree
dispersion: -0.051540079 hartree
dispersion: -0.051542843 hartree
dispersion: -0.051539561 hartree
dispersion: -0.051528808 hartree
dispersion: -0.051515249 hartree
dispersion: -0.051488450 hartree
dispersion: -0.051566563 hartree
dispersion: -0.051485528 hartree
dispersion: -0.051490742 hartree
dispersion: -0.051494372 hartree
dispersion: -0.051493786 hartree
energy: -532.3988 -527.1368 -525.4497 -394.6643 -286.4124 -286.0487 -284.3934 -284.2843 -284.0989 -284.0022 -283.8446 -283.8253 -283.2151 -40.7113 -36.7575 -34.4589 -31.9845 -31.1830 -29.3150 -28.6829 -27.3616 -26.6508 -25.6034 -24.7882 -24.0888 -23.0484 -22.9411 -21.5672 -21.2387 -20.2081 -20.0550 -19.6280 -19.2080 -19.0776 -18.7697 -18.4386 -17.9318 -17.4838 -17.1857 -16.9248 -16.7325 -16.3022 -15.8855 -14.7474 -13.9534 -13.8888 -13.5489 -12.6944 -3.1827 -2.7014 -2.4881 -0.9841 -0.6398 -0.4478 -0.2359 0.5545 0.7424 1.1989 1.3985 electronvolt
chargesum: 1.0000000
charge: -0.119193 -0.148927 0.065315 -0.101003 -0.127602 0.108052 0.151186 0.149082 0.144265 0.171725 -0.033160 0.301933 -0.119151 0.115380 0.112292 0.020915 0.113624 0.246427 -0.219634 0.220105 0.170040 0.165027 -0.393115 -0.293784 0.300204
charge: -0.002451 0.049602 -0.039883 0.049194 0.019659 -0.102178 0.032657 0.039138 0.040037 0.039845 0.740165 0.009135 0.009987 0.031046 0.039957 -0.144202 0.029479 -0.435787 0.382117 -0.101414 -0.047312 -0.046389 0.263967 0.136400 0.007230
qa: -0.1192 -0.1489 0.0653 -0.1010 -0.1276 0.1081 0.1512 0.1491 0.1443 0.1717 -0.0332 0.3019 -0.1192 0.1154 0.1123 0.0209 0.1136 0.2464 -0.2196 0.2201 0.1700 0.1650 -0.3931 -0.2938 0.3002
va: 4.0769 4.0992 3.7476 4.0395 4.1107 3.6925 0.9980 1.0327 1.0106 0.9946 2.6215 0.9602 3.7087 1.0113 1.0248 4.0397 0.9998 4.3704 2.2298 1.0187 1.0304 1.0178 3.0820 2.1983 0.9635
dispersion: -0.051492870 hartree
energy: -630.802706495783 hartree
dipole: 2.274604777 1.757116010 4.031720787 -1.322713610 2.550713462 1.227999852 4.420584539 -4.639607321 -0.219022782
dipolemethod: SCF
magnitude: 4.220275716 au
magnitude: 10.727088374 debye
temp: 298.15 k
press: 1.00 atm
zeropoint: 0.20788307 hartree
thermalvibcorrection: 0.01000165 hartree
thermalrotcorrection: 0.00141627 hartree
thermaltrasncorrection: 0.00141627 hartree
thermaltotal: -630.58198924 hartree
thermalcorr: 0.01283419 hartree
nonthermalcorr: 0.20788307 hartree
totalcorr: 0.22071726 hartree
thermalcorrenthalpy: 0.00094421 hartree
totalenthalpy: -630.58104503 hartree
vibrat: 0.01736175 hartree
rotat: 0.01484405 hartree
transl: 0.01972090 hartree
total: 0.05192671 hartree
totalentropycorr: -0.05192671 hartree
gibbsenthalpy: -630.63297173 hartree
gibbsminuselec: 0.16973476 hartree
