program: Orca
programVersion: 6.0.0
elementType: C C C C C C H H H H O H C H H C H C O H H H N O H
charge: 1
multiplicity: 1
keywords: wB97X-D3BJ TightOpt Freq def2-TZVPP def2/J RIJCOSX TightSCF defgrid3 CHELPG
frequency: 0.00 0.00 0.00 0.00 0.00 0.00 32.58 37.20 65.23 87.46 151.30 167.29 241.38 276.98 308.34 309.40 357.84 368.31 397.70 411.26 426.03 477.57 517.28 558.74 631.74 640.63 659.40 691.24 708.66 739.96 749.62 807.63 832.84 843.54 872.33 978.29 982.07 1014.88 1016.91 1028.86 1065.74 1111.06 1126.15 1150.88 1176.64 1206.57 1216.49 1229.80 1252.44 1331.47 1335.28 1344.96 1366.69 1379.40 1401.99 1476.63 1509.49 1548.62 1651.22 1653.00 1671.14 1713.21 1859.28 3079.67 3098.14 3139.42 3217.83 3219.36 3233.82 3243.34 3601.57 3696.86 3708.51 3775.30 3790.72
frequency: 32.58 37.20 65.23 87.46 151.30 167.29 241.38 276.98 308.34 309.40 357.84 368.31 397.70 411.26 426.03 477.57 517.28 558.74 631.74 640.63 659.40 691.24 708.66 739.96 749.62 807.63 832.84 843.54 872.33 978.29 982.07 1014.88 1016.91 1028.86 1065.74 1111.06 1126.15 1150.88 1176.64 1206.57 1216.49 1229.80 1252.44 1331.47 1335.28 1344.96 1366.69 1379.40 1401.99 1476.63 1509.49 1548.62 1651.22 1653.00 1671.14 1713.21 1859.28 3079.67 3098.14 3139.42 3217.83 3219.36 3233.82 3243.34 3601.57 3696.86 3708.51 3775.30 3790.72
formula: C9H12NO3
InChI: InChI=1/C9H12NO3/c10-8(9(12)13)5-6-1-3-7(11)4-2-6/h1-4,8,12H,5,10-11H2
25 atoms
C  2.769019 0.434548 0.359572
C  1.538533 0.296782 0.98563
C  0.356077 0.648746 0.33729
C  0.412088 1.185759 -0.946991
C  1.621992 1.337706 -1.60725
C  2.740513 0.941288 -0.915431
H  3.696254 0.154036 0.841593
H  1.503431 -0.107917 1.990053
H  -0.502053 1.460124 -1.457874
H  1.668091 1.72911 -2.616594
O  4.068037 1.048451 -1.595769
H  4.294865 1.952055 -1.871173
C  -0.969296 0.40099 1.007102
H  -0.927654 0.711503 2.05207
H  -1.747208 0.996038 0.521075
C  -1.392742 -1.084462 0.998564
H  -0.606767 -1.666692 1.485955
C  -1.421384 -1.595956 -0.454112
O  -2.62374 -1.885245 -0.963956
H  -3.286772 -1.792906 -0.267631
H  -3.356287 -0.585216 1.556353
H  -2.913992 -2.159088 1.964719
N  -2.604269 -1.221841 1.767051
O  -0.419578 -1.704237 -1.10914
H  4.169342 0.426227 -2.335799
totalener: -630.74282792218128 hartree
nucrepener: 810.14411721068291 hartree
electener: -1440.88694751153434 hartree
oneelecener: -2451.02222077339138 hartree
twoeener: 1010.13527326185715 hartree
kineticenergy: 628.21567462039741 hartree
exchangeener: -55.761319036558 hartree
correlationener: -4.053985183699 hartree
xcener: -59.815304220257 hartree
dispersion: -0.051566751 hartree
dispersion: -0.050106536 hartree
dispersion: -0.050333684 hartree
dispersion: -0.050762228 hartree
dispersion: -0.050576564 hartree
dispersion: -0.050573816 hartree
dispersion: -0.050590790 hartree
dispersion: -0.050619451 hartree
dispersion: -0.050676402 hartree
dispersion: -0.050724769 hartree
dispersion: -0.050783113 hartree
dispersion: -0.050801784 hartree
dispersion: -0.050788463 hartree
dispersion: -0.050779938 hartree
dispersion: -0.050780452 hartree
dispersion: -0.050787918 hartree
dispersion: -0.050797178 hartree
dispersion: -0.050615720 hartree
dispersion: -0.050730506 hartree
dispersion: -0.050834433 hartree
dispersion: -0.050875712 hartree
dispersion: -0.050775769 hartree
dispersion: -0.050683467 hartree
dispersion: -0.050657009 hartree
dispersion: -0.050668847 hartree
dispersion: -0.050667861 hartree
dispersion: -0.050660263 hartree
dispersion: -0.050652054 hartree
dispersion: -0.050631687 hartree
dispersion: -0.050616893 hartree
dispersion: -0.050604877 hartree
dispersion: -0.050603500 hartree
dispersion: -0.050605168 hartree
dispersion: -0.050604397 hartree
energy: -532.3684 -526.8419 -525.1279 -395.0408 -286.3638 -285.7837 -284.3571 -284.2783 -284.0966 -284.0253 -283.8238 -283.8180 -283.2722 -40.6816 -36.5280 -34.1663 -31.9515 -31.3735 -29.3663 -28.6685 -27.3344 -26.6117 -25.5321 -24.7909 -24.1478 -23.0356 -22.7041 -21.6132 -20.9695 -20.8342 -19.8012 -19.6553 -19.2352 -19.0361 -18.8747 -18.5186 -18.0364 -17.6352 -17.2811 -16.6749 -16.4937 -16.2555 -15.7266 -14.4658 -14.2317 -13.8741 -13.6433 -12.2869 -3.1397 -2.6882 -2.4336 -0.9345 -0.6864 -0.2722 -0.1330 0.4973 0.8943 1.0618 1.4160 electronvolt
chargesum: 1.0000000
charge: -0.155709 -0.103120 0.034773 -0.075770 -0.124188 0.123392 0.170251 0.149647 0.141322 0.148343 -0.034126 0.299889 -0.159240 0.137088 0.102221 0.041725 0.109300 0.259450 -0.217488 0.208287 0.159297 0.178113 -0.386455 -0.310199 0.303196
charge: 0.017818 0.046875 -0.036960 0.049173 0.003752 -0.101170 0.038867 0.038820 0.038631 0.033506 0.739845 0.007107 0.012911 0.042169 0.034598 -0.147011 0.039429 -0.438685 0.383756 -0.116551 -0.055952 -0.051055 0.287893 0.122035 0.010200
qa: -0.1557 -0.1031 0.0348 -0.0758 -0.1242 0.1234 0.1703 0.1496 0.1413 0.1483 -0.0341 0.2999 -0.1592 0.1371 0.1022 0.0417 0.1093 0.2594 -0.2175 0.2083 0.1593 0.1781 -0.3865 -0.3102 0.3032
va: 4.1184 4.0624 3.7790 4.0419 4.1156 3.6745 0.9953 0.9952 1.0015 0.9992 2.6215 0.9637 3.8411 1.0091 1.0095 3.8953 1.0120 4.3532 2.2298 1.0548 1.0279 1.0164 3.0628 2.1927 0.9591
dispersion: -0.050605012 hartree
energy: -630.800604177942 hartree
dipole: -1.224526009 4.699433158 3.474907148 2.606941542 -0.494538577 2.112402966 3.869059036 -4.786853764 -0.917794728
dipolemethod: SCF
magnitude: 4.168881522 au
magnitude: 10.596454714 debye
temp: 298.15 k
press: 1.00 atm
zeropoint: 0.20725222 hartree
thermalvibcorrection: 0.01008008 hartree
thermalrotcorrection: 0.00141627 hartree
thermaltrasncorrection: 0.00141627 hartree
thermaltotal: -630.58043934 hartree
thermalcorr: 0.01291262 hartree
nonthermalcorr: 0.20725222 hartree
totalcorr: 0.22016484 hartree
thermalcorrenthalpy: 0.00094421 hartree
totalenthalpy: -630.57949513 hartree
vibrat: 0.01740983 hartree
rotat: 0.01488381 hartree
transl: 0.01972090 hartree
total: 0.05201455 hartree
totalentropycorr: -0.05201455 hartree
gibbsenthalpy: -630.63150968 hartree
gibbsminuselec: 0.16909450 hartree
