program: Gaussian 09
title: 000077513
version: EM64L-G09RevD.01
frameworkgroup: C1[X(C4H12SSi)]
method: RPBEPBE
basis: SDD
operation: Freq
keyword: #p
keyword: freq=noraman
keyword: PBEPBE/SDD
title: #p freq=noraman PBEPBE/SDD
converged: YES YES NO NO
title: Mulliken charges:
elementType: S Si C C C C H H H H H H H H H H H H
charge: -0.162273 1.014243 -0.992737 -0.993511 -1.000024 -0.836433 0.239379 0.252545 0.236011 0.239227 0.236368 0.252591 0.252578 0.235338 0.252728 0.255148 0.255061 0.263761
chargesum: 0.00000
title: Mulliken charges with hydrogens summed into heavy atoms:
elementType: S Si C C C C
charge: -0.162273 1.014243 -0.264803 -0.265325 -0.259379 -0.062463
polarizability: 1.01030415e+02 -1.24630237e+00 8.25509252e+01 -1.52336181e-02 5.46376096e-03 7.33108977e+01
1716.lowfreq: -9.3391 -0.0014 0.0017 0.0025 12.8663 31.9940 58.3126 110.0404 119.7273
frequency: 57.9620 110.0300 119.6817 121.9204 132.2161 134.5855 163.6441 182.7809 203.2682 216.6028 248.0861 397.2640 601.1330 652.5818 698.0964 709.6228 754.9248 803.8165 812.0346 912.6994 917.4981 919.0480 964.0381 977.7728 1296.2557 1299.7823 1312.9293 1340.5746 1434.9207 1443.0580 1445.5239 1447.6806 1448.8018 1459.6630 1460.8068 1463.8518 2980.4574 2981.7391 2986.8903 3007.0343 3079.1069 3081.2154 3088.6075 3096.6979 3097.4403 3100.7456 3121.2226 3130.8615
redmass: 3.0135 1.0226 1.0407 2.6869 1.0265 1.0414 3.1083 2.6863 2.7385 2.8116 3.4268 7.6914 4.1663 7.4925 3.1519 3.0819 1.1697 1.3283 1.3389 1.5028 1.4804 1.4721 1.1731 1.2129 1.2002 1.1973 1.1865 1.1267 1.0547 1.0541 1.0522 1.0503 1.0470 1.0475 1.0555 1.0531 1.0347 1.0345 1.0345 1.0285 1.0976 1.0972 1.0978 1.0988 1.0985 1.0986 1.1056 1.1032
irintensity: 3.1236 0.0237 0.0049 1.2778 0.0103 0.0347 2.0278 0.3015 0.6267 4.1850 3.4318 24.5146 13.9244 6.4509 11.6221 8.0788 0.1688 11.5602 12.0298 77.2812 85.6177 201.7010 11.7212 5.9534 45.2361 45.7502 12.7741 0.6504 0.0162 0.5750 6.6501 5.7479 15.0234 7.2823 8.6281 24.3125 12.0855 14.9032 11.4715 35.7360 1.0953 27.7059 14.2215 5.4282 16.9808 13.3173 22.0933 9.6744
temp: 298.150 k
press: 1.00000 atm
elementType: 16 14 6 6 6 6 1 1 1 1 1 1 1 1 1 1 1 1
symmnumber: 1
zpe: 391281.6 jmol-1
zpe.correction: 0.149031 hartree
zpe.thermalcorrener: 0.160320 hartree
zpe.thermalcorrenthalpy: 0.161264 hartree
zpe.thermalcorrgfe: 0.112303 hartree
zpe.sumelectzpe: -846.594425 hartree
zpe.sumelectthermal: -846.583136 hartree
zpe.sumelectthermalent: -846.582192 hartree
zpe.sumelectthermalfe: -846.631154 hartree
dipole: -1.1777 -2.1139 -0.0083
dipole: 2.4198
quadrupole: -51.2573 -56.2450 -55.3668
quadrupole: -3.7041 -0.0087 -0.0093
quadrupole: 3.0324 -1.9553 -1.0771 -3.7041 -0.0087 -0.0093
hfenergy: -846.7434561 hartree
pointgroup: C01 [X(C4H12S1Si1)]
dipole: -0.3554346 0.8794709 0.0810172 debye
dipolederiv: -0.6244701 0.050077 0.0046904 0.0919445 -0.3165928 0.0088693 0.0078816 0.0070305 -0.4066205 1.549217 -0.0812126 -0.007643 -0.2482029 1.1389644 -0.0049404 -0.0225735 -0.0043735 1.1847241 -0.3674295 0.0232115 -0.0435224 0.044667 -0.3856816 0.0944966 0.0114395 0.0675616 -0.4139874 -0.3669475 0.0152334 0.0447296 0.0446986 -0.3604813 -0.0856776 -0.0053567 -0.0591018 -0.4397125 -0.4462598 -0.1243499 -0.0091115 -0.0305099 -0.343089 -0.0024524 -0.0017322 -0.0009206 -0.3129609 0.1109959 0.0753439 0.0069012 0.178716 0.0259911 -0.0057333 0.0154296 -0.0042291 0.0769379 -0.0201083 -0.1317509 0.0229337 -0.1292394 -0.0041801 0.0026988 0.0283978 0.0171474 0.1068355 0.1076176 0.0053937 0.0010676 -0.0096623 0.0785546 -0.0701475 0.0052529 -0.0894347 -0.0982893 -0.0581558 0.1229644 -0.0121933 0.1570096 0.0041621 0.0201156 -0.0538522 0.0368144 0.0938003 -0.02155 -0.1277455 -0.0415164 -0.123368 0.0015557 -0.0165513 -0.0462238 -0.0316223 0.1023131 -0.0558926 0.1178896 0.0353145 0.1450621 0.0168568 -0.0356116 0.0818129 -0.0518868 0.080675 0.1072254 0.0081515 -0.0048762 -0.0063615 0.0483215 0.0942612 -0.011293 0.1133531 -0.0678597 0.1207968 -0.0052843 0.0202037 -0.003838 -0.0031197 0.1260705 0.0101162 0.1094246 -0.0097432 -0.1447213 0.0768626 0.006511 0.0466302 0.0742048 -0.0030561 0.0047982 -0.0032268 0.1144023 0.1214781 -0.0023906 -0.0218654 -0.0032713 0.0315338 -0.119502 -0.0116702 -0.1032463 -0.0431591 0.0614327 -0.0371026 0.0145709 -0.0943803 -0.0154838 -0.1115738 -0.0181926 -0.0944915 -0.064517 0.0603971 -0.0346414 -0.0203937 -0.0969708 -0.0516421 0.1140753 0.002569 0.0968047 -0.0283911 -0.1336256 0.04935 0.0041993 0.0370761 0.0601256 -0.0053415 0.0031962 -0.005603 0.1255527 unknown
polarizability: 101.0499379|-1.0822832|82.4603871|-0.147834|0.8055668|73.3819129 unknown
InChI: InChI=1S/C4H12SSi/c1-5-6(2,3)4/h1-4H3
charge 0 multiplicity 1
18 atoms
S  1.283729 -1.2155 -0.115093
Si -0.61272 0.052269 0.004948
C  -0.661867 1.258951 -1.474666
C  -0.628592 1.003048 1.66144
C  -2.010872 -1.240355 -0.085538
C  2.629605 0.115049 0.001945
H  0.199166 1.951726 -1.45967
H  -0.635417 0.701588 -2.427531
H  -1.585811 1.868131 -1.453827
H  0.23218 1.691891 1.739016
H  -1.552547 1.604268 1.76056
H  -0.580185 0.298525 2.510403
H  -1.945004 -1.949804 0.758123
H  -3.000319 -0.747542 -0.04506
H  -1.952455 -1.818234 -1.024752
H  2.55832 0.659219 0.956769
H  2.56208 0.814108 -0.846301
H  3.589309 -0.421836 -0.042267
