program: Orca
programVersion: 6.0.1
elementType: C C C C C C P C C C C C C C O Pd P C C C C C C C C C C C O C C C C C C C C C C C C C C C C C C C C C C C C O C C C C C C N C C C C C C C C C C C C C C N H H H H H H H H H H H H H H H H H H H H H H H H H H H H H H H H H H H H H H H H H H H H H H H H H H H H H H H H H H
elementType: Pd
charge: 0
multiplicity: 1
keywords: UKS r2SCAN def2-SV(P) def2/J CPCM(thf) FREQ defgrid3
formula: C68H58N2O3P2Pd
InChI: InChI=1/C52H42N2O2P2.C13H11O.C3H5.Pd/c55-51(45-35-19-21-37-47(45)57(41-27-11-3-12-28-41)42-29-13-4-14-30-42)53-49(39-23-7-1-8-24-39)50(40-25-9-2-10-26-40)54-52(56)46-36-20-22-38-48(46)58(43-31-15-5-16-32-43)44-33-17-6-18-34-44;14-13-10-6-2-5-9-12(13)11-7-3-1-4-8-11;1-3-2;/h1-38,49-50,53-54H;1-9H,10H2;3H,1-2H2;/rC55H47N2O2P2Pd.C13H11O/c1-41-40-62(41)60(44-28-12-4-13-29-44,45-30-14-5-15-31-45)50-38-22-20-36-48(50)54(58)56-52(42-24-8-2-9-25-42)53(43-26-10-3-11-27-43)57-55(59)49-37-21-23-39-51(49)61(62,46-32-16-6-17-33-46)47-34-18-7-19-35-47;14-13-10-6-2-5-9-12(13)11-7-3-1-4-8-11/h2-39,41,52-53,56-57H,1,40H2;1-9H,10H2
134 atoms
C  2.667408 -1.265525 3.744632
C  1.769592 -0.556798 2.924011
C  1.579637 0.824258 3.178378
C  2.287751 1.439614 4.227468
C  3.15083 0.714061 5.045742
C  3.342971 -0.647786 4.799464
P  0.923489 -1.459681 1.537284
C  -0.585126 -2.089684 2.402655
C  -1.002091 -1.620585 3.661839
C  -2.174632 -2.113874 4.250149
C  -2.931164 -3.093004 3.600202
C  -2.508999 -3.583991 2.357472
C  -1.349683 -3.083907 1.761547
C  0.686095 1.769217 2.426305
O  1.05088 2.930184 2.205916
Pd 0.696581 -0.482881 -0.626528
P  2.603377 0.800178 -1.053709
C  3.610374 1.524287 0.30849
C  3.739154 2.909255 0.498863
C  4.550458 3.410089 1.524624
C  5.244866 2.534841 2.364885
C  5.111061 1.15085 2.18928
C  4.290562 0.649025 1.177921
C  -0.671499 -1.553764 -1.963623
C  -0.04041 -0.484876 -2.66104
C  -1.810518 -1.332646 -1.16745
C  -3.702501 -2.267244 -2.345941
C  -4.559395 -1.882115 -1.220006
O  -4.477221 -2.362876 -0.078512
C  -3.156335 -3.647684 -2.403268
C  -2.172065 -3.993036 -3.363318
C  -1.657906 -5.289798 -3.46167
C  -2.101487 -6.298568 -2.598993
C  -3.072038 -5.981015 -1.639454
C  -3.586544 -4.685277 -1.539024
C  -3.714912 -1.516588 -3.586368
C  -3.888799 -0.16603 -3.802893
C  -4.211432 0.815614 -2.799166
C  -4.949995 0.529881 -1.692368
C  -5.607274 -0.801053 -1.508661
C  1.903483 -3.01562 1.368137
C  1.710162 -4.132533 2.202994
C  2.480762 -5.286769 2.028164
C  3.452895 -5.342436 1.021475
C  3.651665 -4.236822 0.187186
C  2.87829 -3.083544 0.358234
C  2.419773 2.264479 -2.189302
C  1.227119 3.011049 -2.338326
C  1.202797 4.102988 -3.230306
C  2.334304 4.486953 -3.946057
C  3.516126 3.753695 -3.801183
C  3.547362 2.65653 -2.94005
C  -0.123039 2.742358 -1.719713
O  -1.101581 2.618506 -2.460673
C  3.882876 -0.239859 -1.90815
C  3.470249 -1.336669 -2.685769
C  4.405208 -2.141238 -3.346388
C  5.772347 -1.866517 -3.233502
C  6.197213 -0.784928 -2.453108
C  5.262607 0.020894 -1.794337
N  -0.244053 2.742571 -0.370659
C  -1.588872 2.699156 0.19803
C  -1.567337 2.349126 1.713715
C  -2.937604 1.89047 2.171697
C  -3.463506 0.663555 1.731596
C  -4.728489 0.237418 2.149562
C  -5.488245 1.042376 3.007728
C  -4.974836 2.268589 3.447164
C  -3.70453 2.688143 3.034078
C  -2.317489 4.022849 0.006711
C  -3.620935 4.066221 -0.504643
C  -4.294871 5.285707 -0.640518
C  -3.667145 6.4793 -0.266322
C  -2.363002 6.4457 0.244608
C  -1.693889 5.225039 0.381312
N  -0.559613 1.353252 2.078816
H  -1.292972 3.270475 2.256153
H  -2.137582 1.911203 -0.345158
H  -0.671423 5.207031 0.780322
H  -1.863231 7.376394 0.539201
H  -4.191756 7.436116 -0.374961
H  -5.313364 5.302016 -1.046454
H  -4.11025 3.132391 -0.803592
H  -2.8859 0.022907 1.05211
H  -5.109423 -0.723887 1.784233
H  -6.482644 0.714379 3.333596
H  -5.564888 2.903669 4.118691
H  -3.303927 3.648843 3.38064
H  0.534284 2.998328 0.244634
H  -0.895465 0.438637 2.380886
H  4.478413 2.088068 -2.856541
H  4.416263 4.027624 -4.363504
H  2.289852 5.348344 -4.622384
H  0.262972 4.652228 -3.352923
H  2.851867 -2.32743 3.555043
H  4.027158 -1.236113 5.422036
H  3.680653 1.214187 5.864622
H  2.141706 2.512279 4.389958
H  0.697932 -0.707312 -3.441933
H  -0.291335 -2.580702 -2.064379
H  -0.598486 0.450948 -2.801088
H  -2.149345 -2.050014 -0.416444
H  -2.245539 -0.325408 -1.1310
H  -0.407134 -0.877868 4.206688
H  -2.488172 -1.731835 5.228836
H  -3.847024 -3.47955 4.062309
H  -3.090631 -4.355634 1.840946
H  -1.023407 -3.488616 0.795661
H  0.95563 -4.104648 2.997086
H  2.318195 -6.149763 2.684665
H  4.051592 -6.250795 0.88522
H  4.404831 -4.270264 -0.609081
H  3.025291 -2.228023 -0.309766
H  3.210298 3.608654 -0.158139
H  4.642178 4.494384 1.659874
H  5.887693 2.928814 3.161169
H  5.645086 0.456475 2.847997
H  4.197835 -0.436488 1.049597
H  5.618446 0.857542 -1.183662
H  7.266387 -0.564067 -2.351817
H  6.506994 -2.499142 -3.745533
H  4.059243 -2.99322 -3.943291
H  2.406329 -1.583847 -2.752642
H  -6.318586 -0.787789 -0.667023
H  -5.093031 1.284817 -0.907265
H  -3.843997 1.84152 -2.948306
H  -3.699178 0.199614 -4.822725
H  -3.449083 -2.093321 -4.483146
H  -4.344856 -4.470104 -0.783055
H  -3.443076 -6.757434 -0.958026
H  -1.698245 -7.315713 -2.672576
H  -0.895191 -5.508855 -4.219799
H  -1.785337 -3.22508 -4.04166
H  -6.140539 -1.081919 -2.441687
elementType: C P O Pd N H
totalener: -3767.84386053011622 hartree
cpcmener: -0.04482968752771 hartree
kineticenergy: 3654.22809405782300 hartree
exchangeener: -468.582090479402 hartree
correlationener: -18.351976088889 hartree
xcener: -486.934066568291 hartree
s2: 0.000000
chargesum: -0.0000000
charge: -0.150935 -0.097984 -0.003207 -0.111711 -0.092146 -0.074595 0.294934 -0.112739 -0.160589 -0.089770 -0.103447 -0.086266 -0.133620 0.228481 -0.340175 -0.210943 0.300141 -0.105314 -0.106291 -0.110861 -0.103354 -0.089203 -0.122363 -0.206775 -0.327953 -0.312145 -0.034773 0.061962 -0.336014 0.065577 -0.197314 -0.109375 -0.122785 -0.111132 -0.174033 -0.161544 -0.173874 -0.108231 -0.278771 -0.080280 -0.111476 -0.133962 -0.095936 -0.095646 -0.106430 -0.163737 -0.084565 -0.020338 -0.124668 -0.093627 -0.080034 -0.151124 0.240026 -0.330166 -0.114594 -0.167869 -0.092163 -0.096138 -0.100883 -0.123334 -0.366520 -0.003903 0.079238 0.033018 -0.200251 -0.109615 -0.102839 -0.106038 -0.152453 0.094895 -0.176110 -0.110339 -0.108666 -0.105903 -0.178101 -0.377597 0.123442 0.149984 0.104017 0.112777 0.115602 0.109842 0.128110 0.138765 0.117196 0.115960 0.116076 0.107499 0.333401 0.343563 0.133189 0.121542 0.126259 0.117079 0.142308 0.121280 0.123267 0.112209 0.207817 0.222858 0.234114 0.225994 0.259314 0.137805 0.118895 0.121565 0.120292 0.148242 0.134199 0.121142 0.123346 0.115558 0.219433 0.128899 0.113770 0.115646 0.111599 0.131374 0.140930 0.120036 0.123864 0.119867 0.176737 0.104015 0.153800 0.113221 0.098157 0.102656 0.103762 0.100474 0.102331 0.100225 0.107981 0.133978
charge: -0.123545 -0.159193 -0.062669 -0.092683 -0.114120 -0.112858 0.796265 -0.183993 -0.149514 -0.122729 -0.122460 -0.114024 -0.118474 0.084566 -0.254659 -0.895981 0.828533 -0.179833 -0.123366 -0.129963 -0.124085 -0.122719 -0.117229 -0.120537 -0.235934 -0.135546 -0.125188 0.059006 -0.260565 -0.028493 -0.143992 -0.141541 -0.160020 -0.143529 -0.145920 -0.136117 -0.185815 -0.164786 -0.158153 -0.235719 -0.174162 -0.123369 -0.125961 -0.116346 -0.125562 -0.116751 -0.162359 -0.057223 -0.102466 -0.115885 -0.119061 -0.122264 0.082981 -0.248779 -0.173689 -0.115903 -0.125520 -0.117148 -0.127070 -0.124476 -0.136487 -0.046838 -0.042973 -0.050582 -0.127029 -0.127391 -0.130143 -0.129525 -0.122816 -0.044694 -0.124624 -0.129989 -0.135262 -0.131253 -0.130532 -0.135317 0.134801 0.138329 0.132651 0.136798 0.136640 0.137558 0.137018 0.139367 0.134182 0.137769 0.138371 0.138267 0.259250 0.253985 0.142226 0.143281 0.144305 0.144482 0.143779 0.143187 0.143359 0.143219 0.148361 0.161859 0.157892 0.147887 0.157322 0.140335 0.141396 0.141186 0.140533 0.144998 0.142124 0.141839 0.141407 0.140362 0.150002 0.138200 0.138633 0.137785 0.136998 0.137428 0.142415 0.141682 0.141618 0.142233 0.153976 0.127861 0.124991 0.126316 0.126521 0.127360 0.130883 0.129910 0.130114 0.130649 0.130790 0.137362
qa: -0.1509 -0.0980 -0.0032 -0.1117 -0.0921 -0.0746 0.2949 -0.1127 -0.1606 -0.0898 -0.1034 -0.0863 -0.1336 0.2285 -0.3402 -0.2109 0.3001 -0.1053 -0.1063 -0.1109 -0.1034 -0.0892 -0.1224 -0.2068 -0.3280 -0.3121 -0.0348 0.0620 -0.3360 0.0656 -0.1973 -0.1094 -0.1228 -0.1111 -0.1740 -0.1615 -0.1739 -0.1082 -0.2788 -0.0803 -0.1115 -0.1340 -0.0959 -0.0956 -0.1064 -0.1637 -0.0846 -0.0203 -0.1247 -0.0936 -0.0800 -0.1511 0.2400 -0.3302 -0.1146 -0.1679 -0.0922 -0.0961 -0.1009 -0.1233 -0.3665 -0.0039 0.0792 0.0330 -0.2003 -0.1096 -0.1028 -0.1060 -0.1525 0.0949 -0.1761 -0.1103 -0.1087 -0.1059 -0.1781 -0.3776 0.1234 0.1500 0.1040 0.1128 0.1156 0.1098 0.1281 0.1388 0.1172 0.1160 0.1161 0.1075 0.3334 0.3436 0.1332 0.1215 0.1263 0.1171 0.1423 0.1213 0.1233 0.1122 0.2078 0.2229 0.2341 0.2260 0.2593 0.1378 0.1189 0.1216 0.1203 0.1482 0.1342 0.1211 0.1233 0.1156 0.2194 0.1289 0.1138 0.1156 0.1116 0.1314 0.1409 0.1200 0.1239 0.1199 0.1767 0.1040 0.1538 0.1132 0.0982 0.1027 0.1038 0.1005 0.1023 0.1002 0.1080 0.1340
va: 3.8574 3.8454 3.8147 3.8453 3.7473 3.7753 3.6966 3.8155 3.8642 3.8062 3.7704 3.8476 3.8632 4.1327 2.1993 3.2217 3.7482 3.8366 3.8622 3.8017 3.7645 3.8238 3.8481 4.0241 3.8542 3.7779 3.6045 4.1236 2.1924 3.9308 3.8133 3.7960 3.7545 3.7599 3.7820 3.8986 3.9180 3.8475 3.9749 3.8462 3.8393 3.8297 3.7944 3.7594 3.8102 3.8512 3.8414 3.8313 3.8461 3.7544 3.7893 3.8430 4.0935 2.1960 3.8271 3.8529 3.8005 3.7586 3.8060 3.8482 3.1287 3.9243 3.9197 3.8586 3.8288 3.7969 3.7499 3.7784 3.8191 3.8250 3.8200 3.7877 3.7655 3.8012 3.8011 3.1306 0.9919 0.9956 0.9720 0.9489 0.9481 0.9507 0.9706 0.9658 0.9913 0.9491 0.9484 0.9595 0.9024 0.8758 0.9564 0.9487 0.9473 0.9637 0.9448 0.9487 0.9485 0.9698 0.9047 0.9058 0.9313 0.9325 0.8967 0.9439 0.9494 0.9482 0.9563 0.9492 0.9468 0.9484 0.9475 0.9537 0.9063 0.9458 0.9498 0.9489 0.9525 0.9614 0.9443 0.9490 0.9474 0.9489 0.9339 0.9712 0.9371 0.9612 0.9484 0.9526 0.9835 0.9497 0.9496 0.9499 0.9549 0.9457
energy: -3767.843860530116 hartree
dipole: -59.504128515 65.435288670 5.931160155 27.191879825 -26.633205789 0.558674036 40.175268223 -37.136767645 3.038500578
dipolemethod: SCF
magnitude: 6.687545381 au
magnitude: 16.998389474 debye
temp: 298.15 k
press: 1.00 atm
zeropoint: 1.07154054 hartree
thermalvibcorrection: 0.06409130 hartree
thermalrotcorrection: 0.00141627 hartree
thermaltrasncorrection: 0.00141627 hartree
thermaltotal: -3766.70539614 hartree
thermalcorr: 0.06692385 hartree
nonthermalcorr: 1.07154054 hartree
totalcorr: 1.13846439 hartree
thermalcorrenthalpy: 0.00094421 hartree
totalenthalpy: -3766.70445193 hartree
vibrat: 0.11476662 hartree
rotat: 0.01933248 hartree
transl: 0.02229229 hartree
total: 0.15639139 hartree
totalentropycorr: -0.15639139 hartree
gibbsenthalpy: -3766.86084332 hartree
gibbsminuselec: 0.98301721 hartree
