program: Gaussian 16
title: tropone completo fenile equatoriale
version: ES64L-G16RevA.03
frameworkgroup: C1[X(C22H20O)]
method: RB3LYP
basis: 6-311G(d,p)
operation: Freq
keyword: #N
keyword: Geom=AllCheck
keyword: Guess=TCheck
keyword: SCRF=Check
keyword: GenChk
keyword: RB3LYP/6-311G(d,p)
keyword: Freq
converged: YES YES YES YES
title: Mulliken charges:
elementType: C C C C H H H H C O C H H C C C C C H C H C H H H C H H C H C H C C C C H C H C H H H
charge: -0.103969 -0.078636 -0.099959 -0.143472 0.118870 0.122570 0.122064 0.124145 0.258448 -0.345033 -0.173829 0.159005 0.154692 -0.277085 -0.032209 -0.071515 -0.060443 -0.110049 0.108939 -0.110013 0.103393 -0.104682 0.111289 0.110802 0.110743 -0.114078 0.133939 0.128071 -0.145618 0.105671 -0.060706 0.098311 -0.082840 -0.083602 -0.089143 -0.111553 0.107051 -0.110933 0.103937 -0.105642 0.110763 0.111119 0.111186
chargesum: -0.00000
title: Mulliken charges with hydrogens summed into heavy atoms:
elementType: C C C C C O C C C C C C C C C C C C C C C C C
charge: 0.014901 0.043935 0.022106 -0.019327 0.258448 -0.345033 0.139868 -0.277085 -0.032209 0.037424 0.042950 0.001240 0.000789 0.006061 0.147932 -0.039946 0.037605 -0.082840 0.023449 0.014794 -0.000790 0.000187 0.005544
chargesum: 0.00000
1716.lowfreq: -7.3735 -3.7264 -0.0005 0.0004 0.0005 3.9885 17.8154 22.8664 32.9175
frequency: 17.6759 22.8067 32.8980 48.8007 66.8943 80.1458 85.7192 116.5972 131.7357 163.7439 191.5269 198.2634 232.0237 274.7617 281.2177 320.8028 345.3756 357.0552 382.5460 410.5975 413.5885 418.9941 438.1086 477.9878 514.6656 520.2442 536.2258 561.3474 602.8472 633.2080 633.6413 636.2144 674.6583 692.0189 706.7813 716.6709 729.4551 760.6911 773.8967 791.5049 820.2307 852.5773 860.3100 865.6608 867.1746 884.9133 911.9660 921.8999 932.8226 935.6709 976.1566 984.9779 990.5945 1000.4629 1003.9279 1005.9451 1009.4444 1012.7031 1014.6413 1015.4532 1024.8090 1036.7340 1046.7781 1050.3326 1070.0183 1096.0083 1106.1044 1126.4695 1158.1906 1176.2363 1176.6373 1188.0689 1200.0608 1203.7606 1229.9048 1231.9478 1241.4643 1262.1136 1268.7756 1315.2745 1317.1818 1323.4700 1343.5329 1352.7567 1355.9453 1358.6532 1378.8377 1409.1478 1419.6476 1451.7195 1461.7916 1474.5567 1479.0367 1524.4076 1525.6985 1612.9529 1618.6452 1638.1879 1638.7775 1656.2457 1698.6046 1702.2860 1738.9179 3020.7248 3023.4105 3049.6709 3070.7470 3119.4991 3131.3118 3139.4069 3155.2447 3157.1275 3158.0688 3160.5980 3161.1687 3164.8555 3166.9627 3173.7050 3175.8713 3182.1301 3185.1881 3190.3718 3191.4806
redmass: 3.7488 5.0863 4.6048 3.8545 4.3274 3.7359 7.5752 3.2041 4.0092 4.2716 3.6261 2.9815 3.2633 3.9722 3.7763 3.1380 2.9007 5.0319 3.6082 4.4332 2.9560 2.9241 3.9604 3.2089 3.0853 3.5439 3.0904 4.6605 3.7031 6.1684 6.4132 4.2416 1.7932 4.4824 1.8067 1.6354 2.0799 1.7425 1.9758 2.3597 2.2900 1.3140 1.2601 2.7488 3.1933 2.2790 3.1346 2.6577 1.5033 1.5672 2.3316 1.3705 1.3693 1.4159 1.3469 1.3724 1.3008 5.0711 1.3164 4.1503 2.2437 4.0621 2.3696 2.1848 2.4199 1.8825 1.6458 2.3611 2.8827 1.1050 1.1136 2.4426 1.1468 1.1341 1.7948 1.3371 1.1134 1.6818 1.1843 2.0707 2.9246 2.1120 1.5447 1.7526 1.5929 1.4177 1.3637 1.3150 1.0767 1.5603 1.1371 2.1870 2.1274 2.1321 2.1948 5.2103 5.5008 5.5766 5.5513 8.2959 5.6745 5.6832 12.0107 1.0609 1.0620 1.0965 1.1008 1.0885 1.0837 1.0850 1.0933 1.0878 1.0865 1.0951 1.0855 1.0868 1.0877 1.0910 1.0917 1.0931 1.0936 1.0978 1.0971
irintensity: 0.0246 0.0745 0.6010 0.6766 0.4609 0.5386 6.9654 0.9274 1.4615 0.1502 0.2738 1.0084 2.9485 0.5995 1.2932 0.6091 4.1565 0.5141 1.2935 6.5344 0.2567 0.0710 4.4333 3.5138 3.0794 18.5606 6.8478 4.8376 22.0511 1.6654 0.0795 3.9978 100.8268 8.0289 58.3970 86.7239 30.2103 67.4940 23.6731 11.1031 8.0897 0.3146 0.1048 14.6107 4.0815 12.7136 6.9934 1.3421 1.2034 10.3422 35.3799 0.1283 0.1621 21.5180 8.9388 1.5133 1.0879 1.8159 39.2059 6.7966 5.9072 20.2336 13.6120 2.8362 6.4927 3.9263 21.6952 3.6461 39.4160 0.3429 0.3409 11.0257 0.3576 0.7602 0.1673 7.3746 2.1919 7.1264 4.0462 6.7733 0.7325 2.3509 17.1364 9.8014 1.1377 3.9852 2.6676 4.3483 36.4396 2.3542 23.0662 10.6335 7.0366 24.8136 27.1862 2.2272 4.4030 10.7513 13.4249 8.3243 5.2842 1.3337 444.0915 43.5791 6.4504 12.0516 24.5864 29.6149 1.7650 10.5487 46.4549 18.5817 11.2274 41.5723 8.0717 1.5168 3.0767 25.5686 35.3527 53.3687 36.3037 25.9891 14.8254
temp: 298.150 k
press: 1.00000 atm
elementType: 6 6 6 6 1 1 1 1 6 8 6 1 1 6 6 6 6 6 1 6 1 6 1 1 1 6 1 1 6 1 6 1 6 6 6 6 1 6 1 6 1 1 1
symmnumber: 1
zpe: 929078.0 jmol-1
zpe.correction: 0.353867 hartree
zpe.thermalcorrener: 0.373621 hartree
zpe.thermalcorrenthalpy: 0.374565 hartree
zpe.thermalcorrgfe: 0.303223 hartree
zpe.sumelectzpe: -925.436536 hartree
zpe.sumelectthermal: -925.416783 hartree
zpe.sumelectthermalent: -925.415839 hartree
zpe.sumelectthermalfe: -925.487181 hartree
dipole: -2.2139 2.6664 0.1095
dipole: 3.4674
quadrupole: -120.6193 -141.6913 -123.2099
quadrupole: 0.5140 3.9332 -2.2950
quadrupole: 7.8875 -13.1844 5.2969 0.5140 3.9332 -2.2950
hfenergy: -925.7904036 hartree
pointgroup: C01 [X(C22H20O1)]
dipole: -0.880526 1.0385586 0.0841879 debye
polarizability: 387.6589813|19.4677219|285.741791|40.0956171|-26.5771899|299.0681778 unknown
InChI: InChI=1/C22H20O/c23-21-16-8-3-9-17-22(21,20-14-6-2-7-15-20)18-10-13-19-11-4-1-5-12-19/h1-15,17H,16,18H2
charge 0 multiplicity 1
43 atoms
C  -4.62570652 -0.27559945 0.11134055
C  -4.0946191 -0.6824132 -1.18332246
C  -2.80400526 -0.85467776 -1.51023505
C  -4.08042312 -0.52919663 1.30898799
H  -5.5675527 0.26607301 0.08869123
H  -4.82859014 -0.82271284 -1.97292806
H  -2.57574692 -1.19516648 -2.51565077
H  -4.58663796 -0.14512198 2.19001904
C  -1.84438237 -1.6901667 0.53259243
O  -1.25017893 -2.74873411 0.56676455
C  -2.87669699 -1.3724775 1.61050793
H  -2.32041446 -0.90092284 2.43054072
H  -3.19741632 -2.33955659 2.01354346
C  -1.59288088 -0.66429033 -0.60155836
C  -1.4270127 0.77048434 -0.07738984
C  -0.70101512 1.02034924 1.09356491
C  -1.89511909 1.86809257 -0.80797551
C  -0.47254436 2.32261974 1.53590584
H  -0.29730328 0.19625277 1.6710094
C  -1.66167479 3.17156246 -0.37426182
H  -2.45446798 1.70399461 -1.72092104
C  -0.95405327 3.40540138 0.80379559
H  0.08651003 2.48748606 2.45015158
H  -2.03698911 4.00507933 -0.95766905
H  -0.77732241 4.41912935 1.14492769
C  -0.3315205 -1.07677257 -1.43231521
H  -0.51230413 -2.09841917 -1.7847384
H  -0.2986557 -0.42937235 -2.31323203
C  0.98999386 -1.04077263 -0.72531172
H  1.0792173 -1.6877496 0.14189347
C  2.035603 -0.31048245 -1.13337266
H  1.90659163 0.32189553 -2.01025648
C  3.37636474 -0.25239707 -0.5293572
C  3.74827764 -0.99721683 0.6047649
C  4.34247854 0.58845894 -1.10659584
C  5.02979727 -0.90039233 1.13432525
H  3.03172748 -1.65854905 1.07760787
C  5.62713357 0.68583978 -0.57674172
H  4.07800733 1.17214617 -1.98241616
C  5.97764432 -0.05856123 0.5474954
H  5.2929971 -1.48458638 2.00926017
H  6.35296141 1.3430408 -1.04267414
H  6.9761039 0.01364197 0.96332057
