program: Orca
programVersion: 6.0.1
elementType: C C C C C C H C C C C C O C O C O C O C C C C C C C C C C N H H H H H H H H C H H H H H H H H H H H H H H H H
charge: 0
multiplicity: 1
keywords: UKS wB97X-D3 def2-TZVP def2/J RIJCOSX CPCM(Toluene) TightOpt SlowConv TightSCF Freq KeepDens
frequency: 0.00 0.00 0.00 0.00 0.00 0.00 30.08 33.80 47.36 48.46 62.26 62.87 77.82 79.34 91.46 106.68 114.86 148.93 155.87 165.97 175.87 186.95 216.92 222.12 233.82 244.34 279.35 295.87 309.61 319.88 331.10 335.01 370.25 383.15 417.23 419.76 433.33 439.73 482.02 493.98 522.25 535.44 560.23 611.40 623.33 634.73 640.45 649.37 676.41 708.96 724.94 728.67 751.73 787.26 788.87 806.31 814.33 840.51 845.12 861.50 868.85 875.55 876.46 882.31 901.27 920.93 941.96 949.92 957.91 983.31 994.68 1002.26 1010.08 1012.09 1012.78 1025.09 1026.40 1030.77 1038.74 1051.61 1063.79 1070.73 1084.00 1088.79 1093.53 1112.47 1119.30 1137.60 1153.19 1156.01 1162.52 1175.35 1177.65 1178.33 1191.13 1203.42 1211.02 1215.77 1219.90 1224.23 1229.40 1237.94 1247.02 1259.81 1270.52 1283.99 1294.47 1294.80 1305.96 1317.02 1321.83 1322.55 1334.34 1343.58 1354.88 1365.48 1365.67 1395.88 1407.62 1421.47 1460.14 1473.24 1476.76 1478.86 1482.28 1482.98 1488.89 1490.69 1492.62 1493.09 1500.85 1509.71 1528.21 1552.55 1656.94 1658.74 1680.63 1686.34 1804.80 1826.68 3066.38 3079.47 3079.79 3080.80 3089.15 3104.64 3108.83 3133.01 3136.13 3138.72 3141.19 3147.31 3159.60 3160.49 3162.89 3163.04 3188.84 3190.42 3194.66 3195.43 3196.69 3205.63 3214.38 3218.15 3222.34
frequency: 30.08 33.80 47.36 48.46 62.26 62.87 77.82 79.34 91.46 106.68 114.86 148.93 155.87 165.97 175.87 186.95 216.92 222.12 233.82 244.34 279.35 295.87 309.61 319.88 331.10 335.01 370.25 383.15 417.23 419.76 433.33 439.73 482.02 493.98 522.25 535.44 560.23 611.40 623.33 634.73 640.45 649.37 676.41 708.96 724.94 728.67 751.73 787.26 788.87 806.31 814.33 840.51 845.12 861.50 868.85 875.55 876.46 882.31 901.27 920.93 941.96 949.92 957.91 983.31 994.68 1002.26 1010.08 1012.09 1012.78 1025.09 1026.40 1030.77 1038.74 1051.61 1063.79 1070.73 1084.00 1088.79 1093.53 1112.47 1119.30 1137.60 1153.19 1156.01 1162.52 1175.35 1177.65 1178.33 1191.13 1203.42 1211.02 1215.77 1219.90 1224.23 1229.40 1237.94 1247.02 1259.81 1270.52 1283.99 1294.47 1294.80 1305.96 1317.02 1321.83 1322.55 1334.34 1343.58 1354.88 1365.48 1365.67 1395.88 1407.62 1421.47 1460.14 1473.24 1476.76 1478.86 1482.28 1482.98 1488.89 1490.69 1492.62 1493.09 1500.85 1509.71 1528.21 1552.55 1656.94 1658.74 1680.63 1686.34 1804.80 1826.68 3066.38 3079.47 3079.79 3080.80 3089.15 3104.64 3108.83 3133.01 3136.13 3138.72 3141.19 3147.31 3159.60 3160.49 3162.89 3163.04 3188.84 3190.42 3194.66 3195.43 3196.69 3205.63 3214.38 3218.15 3222.34
formula: C25H25NO4
InChI: InChI=1/C25H25NO4/c1-13-9-10-15-18-16-11-24(18,14-7-5-4-6-8-14)19-17(16)12-25(22(27)29-2,23(28)30-3)20(19)21(15)26-13/h4-10,16-20H,11-12H2,1-3H3
55 atoms
C  0.494469 3.977986 2.081869
C  -0.16071 3.042213 1.109241
C  -1.181897 3.46173 0.26461
C  -1.754312 2.546735 -0.598718
C  -1.285528 1.242002 -0.632069
C  -1.970376 0.163235 -1.405199
H  -1.210714 -2.288569 1.704267
C  -1.394372 -0.656645 -2.604652
C  -0.047524 -1.189732 -2.116776
C  1.171063 -0.263634 -2.101263
C  1.705935 -0.370488 -0.664544
C  2.600613 0.804685 -0.280462
O  3.243048 0.556708 0.857567
C  4.053704 1.615316 1.369713
O  2.720738 1.817207 -0.916379
C  2.531288 -1.644566 -0.470979
O  3.593908 -1.640928 -1.274871
C  4.476098 -2.760693 -1.162453
O  2.281712 -2.536507 0.29553
C  0.396796 -0.451727 0.175153
C  -0.442003 -1.464488 -0.634635
C  -1.961842 -1.219881 -0.708435
C  -2.800305 -1.482147 0.505319
C  -4.159819 -1.168134 0.495825
C  -4.955711 -1.402074 1.604385
C  -4.406133 -1.956064 2.753459
C  -3.057501 -2.271036 2.778501
C  -2.263088 -2.035047 1.663952
C  -0.237154 0.919732 0.227612
N  0.292545 1.789699 1.082753
H  -0.05969 4.911422 2.175424
H  1.507563 4.213501 1.74731
H  0.572692 3.50811 3.062769
H  -1.533399 4.485242 0.302044
H  -2.579577 2.839082 -1.239765
H  -2.615889 -2.701748 3.669485
H  -6.009284 -1.149809 1.573426
H  -5.027051 -2.13928 3.622256
C  -2.317408 -1.793231 -2.105654
H  0.190261 -2.115567 -2.643861
H  0.897505 0.775188 -2.287626
H  1.923038 -0.535176 -2.839548
H  4.493192 1.231727 2.286053
H  3.434339 2.486755 1.580586
H  4.830168 1.880817 0.653036
H  3.945344 -3.685092 -1.387499
H  4.88999 -2.814501 -0.155952
H  5.264089 -2.587455 -1.889822
H  0.616915 -0.78238 1.189197
H  -0.204731 -2.478842 -0.318291
H  -4.603175 -0.733394 -0.393382
H  -1.45189 -0.272411 -3.621664
H  -2.986756 0.474547 -1.652134
H  -3.367549 -1.638257 -2.353551
H  -2.020216 -2.820566 -2.324353
totalener: -1322.76302828681764 hartree
nucrepener: 3036.46909818750373 hartree
electener: -4359.21656928396533 hartree
oneelecener: -7839.98226471290036 hartree
twoeener: 3480.76569542893503 hartree
cpcmener: -0.01560309969138 hartree
kineticenergy: 1313.19781916713464 hartree
xcener: -127.512833188785 hartree
s2: -0.000000
dispersion: -0.033529745 hartree
s2: 0.000000
dispersion: -0.033725454 hartree
dispersion: -0.033922029 hartree
dispersion: -0.034161983 hartree
dispersion: -0.034391853 hartree
dispersion: -0.034533337 hartree
dispersion: -0.034587853 hartree
dispersion: -0.034528411 hartree
dispersion: -0.034349098 hartree
dispersion: -0.034104454 hartree
dispersion: -0.033904284 hartree
dispersion: -0.033933942 hartree
dispersion: -0.034088049 hartree
dispersion: -0.034107366 hartree
dispersion: -0.034176871 hartree
dispersion: -0.034183792 hartree
dispersion: -0.034187455 hartree
dispersion: -0.034214634 hartree
dispersion: -0.034251526 hartree
dispersion: -0.034179700 hartree
dispersion: -0.034162519 hartree
dispersion: -0.034123787 hartree
dispersion: -0.034135907 hartree
dispersion: -0.034125361 hartree
dispersion: -0.034124238 hartree
dispersion: -0.034125532 hartree
dispersion: -0.034123213 hartree
dispersion: -0.034119613 hartree
dispersion: -0.034112755 hartree
dispersion: -0.034112059 hartree
dispersion: -0.034105064 hartree
dispersion: -0.034104389 hartree
dispersion: -0.034104572 hartree
elementType: C H O N
energy: -524.8175 -524.6932 -523.2007 -523.0618 -392.2106 -283.4279 -283.3303 -281.0668 -280.9398 -280.7572 -280.7552 -280.7160 -280.1759 -280.0675 -280.0478 -279.9698 -279.9562 -279.9098 -279.8827 -279.7480 -279.7057 -279.6910 -279.6802 -279.6536 -279.6419 -279.6311 -279.6262 -279.6128 -279.6075 -279.3521 -33.8020 -33.5194 -31.1908 -31.0703 -29.1552 -28.2408 -26.6515 -26.3684 -25.2069 -24.7804 -24.0542 -23.8759 -23.4559 -23.1733 -22.9253 -22.5846 -22.1609 -21.2946 -20.6998 -20.4270 -19.6397 -19.4478 -19.3979 -19.0035 -18.8159 -18.0482 -17.8559 -17.5092 -17.4390 -17.2241 -16.8433 -16.4796 -16.4030 -16.1834 -15.9586 -15.8634 -15.7758 -15.6727 -15.1016 -15.0026 -14.9120 -14.7308 -14.6234 -14.5441 -14.2851 -14.0517 -13.9888 -13.7957 -13.6817 -13.5118 -13.4751 -13.3600 -13.0179 -12.8591 -12.8308 -12.7384 -12.6048 -12.5052 -12.4370 -12.3226 -12.0268 -11.9065 -11.6205 -11.4059 -11.2682 -11.1472 -11.1242 -11.0422 -10.9399 -10.6667 -10.5499 -10.0499 -9.9877 -9.4890 -9.2896 -8.9886 -8.7124 1.0907 1.5358 1.7671 1.8154 2.0903 2.6079 3.0740 3.4280 3.4860 3.8080 3.9084 electronvolt
chargesum: 0.0000000
charge: -0.413346 0.195049 -0.174110 -0.251939 -0.109629 0.014981 0.160906 -0.046327 -0.109625 -0.328446 0.334240 0.244152 -0.251289 -0.229874 -0.369821 0.224212 -0.272852 -0.230022 -0.376756 0.081728 -0.184431 0.234751 0.018223 -0.305335 -0.166194 -0.130898 -0.173437 -0.189289 0.022575 -0.350350 0.132473 0.143134 0.143119 0.147026 0.143517 0.138818 0.137696 0.140536 -0.155138 0.096123 0.152910 0.143315 0.147833 0.134982 0.145513 0.143475 0.145895 0.149679 0.146569 0.158169 0.142428 0.114922 0.113406 0.117831 0.108924
charge: -0.257689 -0.239933 -0.126494 -0.081654 -0.100354 -0.106978 0.156687 -0.147092 -0.167337 -0.156801 -0.166489 -0.446630 0.268849 -0.297802 0.108531 -0.433577 0.261283 -0.297100 0.109410 -0.110690 -0.113134 -0.146044 -0.100836 -0.107125 -0.145923 -0.149922 -0.143320 -0.104549 -0.145146 0.181954 0.127876 0.132355 0.132852 0.152513 0.155661 0.149136 0.148338 0.147621 -0.145770 0.155323 0.155947 0.143745 0.117528 0.114419 0.115464 0.115932 0.117070 0.117641 0.168759 0.159042 0.151332 0.135918 0.166654 0.139025 0.131527
qa: -0.4133 0.1950 -0.1741 -0.2519 -0.1096 0.0150 0.1609 -0.0463 -0.1096 -0.3284 0.3342 0.2442 -0.2513 -0.2299 -0.3698 0.2242 -0.2729 -0.2300 -0.3768 0.0817 -0.1844 0.2348 0.0182 -0.3053 -0.1662 -0.1309 -0.1734 -0.1893 0.0226 -0.3504 0.1325 0.1431 0.1431 0.1470 0.1435 0.1388 0.1377 0.1405 -0.1551 0.0961 0.1529 0.1433 0.1478 0.1350 0.1455 0.1435 0.1459 0.1497 0.1466 0.1582 0.1424 0.1149 0.1134 0.1178 0.1089
va: 3.8762 3.8358 3.8769 4.0887 3.8060 3.7175 0.9674 3.9359 4.0837 4.0596 3.6276 4.3067 2.1130 3.8807 2.1358 4.2577 2.1295 3.8652 2.1301 4.0076 4.1145 3.4806 3.4681 3.9807 3.9382 3.8700 3.9254 3.9320 3.9189 3.0302 0.9703 0.9628 0.9734 0.9678 0.9741 0.9714 0.9702 0.9665 3.9611 0.9698 0.9762 0.9770 0.9672 0.9653 0.9681 0.9671 0.9669 0.9666 0.9848 0.9576 0.9760 0.9787 0.9743 0.9839 0.9852
dispersion: -0.034105528 hartree
energy: -1323.524005286857 hartree
dipole: -0.196897972 0.082366110 -0.114531863 1.550487221 -1.450196434 0.100290787 0.797270478 -1.311239564 -0.513969086
dipolemethod: SCF
magnitude: 0.536041054 au
magnitude: 1.362508078 debye
temp: 298.15 k
press: 1.00 atm
zeropoint: 0.45724353 hartree
thermalvibcorrection: 0.02253371 hartree
thermalrotcorrection: 0.00141627 hartree
thermaltrasncorrection: 0.00141627 hartree
thermaltotal: -1323.04139550 hartree
thermalcorr: 0.02536625 hartree
nonthermalcorr: 0.45724353 hartree
totalcorr: 0.48260979 hartree
thermalcorrenthalpy: 0.00094421 hartree
totalenthalpy: -1323.04045129 hartree
vibrat: 0.03974626 hartree
rotat: 0.01695518 hartree
transl: 0.02084687 hartree
total: 0.07754831 hartree
totalentropycorr: -0.07754831 hartree
gibbsenthalpy: -1323.11799960 hartree
gibbsminuselec: 0.40600568 hartree
