program: Orca
programVersion: 5.0.3
elementType: C C C C C C H C C C C C O C O C O C O C C C C C C C C C C N H H H H H H H H C H H H H H H H H H H H H H H H H
formula: C25H25NO4
InChI: InChI=1/C25H25NO4/c1-13-10-11-16-18-14(2)17-12-25(23(27)29-3,24(28)30-4)21(22(16)26-13)20(17)19(18)15-8-6-5-7-9-15/h5-11,14,17-18,20-21H,2,12H2,1,3-4H3
55 atoms
C  0.830822 4.348033 1.684925
C  0.05776 3.325972 0.89849
C  -1.063651 3.672268 0.138251
C  -1.721304 2.680884 -0.581013
C  -1.246671 1.370953 -0.547402
C  -1.962138 0.221317 -1.225373
H  -1.306402 -2.891351 1.52442
C  -1.330207 -0.421955 -2.485499
C  -0.020742 -1.065713 -1.972986
C  1.258372 -0.21086 -2.027984
C  1.821373 -0.24712 -0.596927
C  2.741652 0.933898 -0.293143
O  3.380322 0.74132 0.858192
C  4.198715 1.806147 1.323332
O  2.886582 1.901593 -0.992856
C  2.634671 -1.518138 -0.344855
O  3.706886 -1.550641 -1.134502
C  4.583601 -2.661235 -0.979736
O  2.368736 -2.384528 0.44795
C  0.530212 -0.260097 0.264946
C  -0.347307 -1.316277 -0.46837
C  -1.809082 -0.996842 -0.347745
C  -2.68467 -1.423235 0.701904
C  -3.974682 -0.857681 0.863457
C  -4.825019 -1.288521 1.873131
C  -4.423877 -2.295505 2.756467
C  -3.154133 -2.864718 2.617821
C  -2.296567 -2.438723 1.612343
C  -0.107294 1.120069 0.234778
N  0.505996 2.06876 0.939395
H  0.289229 5.300058 1.764452
H  1.796702 4.541352 1.191511
H  1.045917 3.969117 2.69422
H  -1.418396 4.705157 0.120605
H  -2.612885 2.921807 -1.167738
H  -2.829304 -3.648197 3.307493
H  -5.813773 -0.833649 1.976194
H  -5.095836 -2.631831 3.549838
C  -2.293994 -1.531289 -2.760098
H  0.145513 -2.020031 -2.493671
H  1.040603 0.837107 -2.280969
H  1.987398 -0.572048 -2.765133
H  4.680094 1.443962 2.237964
H  3.576822 2.684539 1.5458
H  4.954242 2.074309 0.572048
H  4.051425 -3.603438 -1.170924
H  4.998169 -2.683634 0.037868
H  5.384619 -2.521232 -1.713257
H  0.751156 -0.537014 1.305182
H  -0.06784 -2.319363 -0.126545
H  -4.305373 -0.06916 0.183786
H  -1.162403 0.272382 -3.332384
H  -3.00109 0.512699 -1.434251
H  -3.370615 -1.33945 -2.729992
H  -1.962335 -2.450228 -3.253407
elementType: C H O N
totalener: -1323.39085517 hartree
nucrepener: 3077.52282201 hartree
electener: -4400.91367719 hartree
oneelecener: -7922.47204883 hartree
twoeener: 3521.55837165 hartree
cpcmener: -0.01388551 hartree
kineticenergy: 1317.07807005 hartree
xcener: -128.435087569364 hartree
s2: 2.053228
chargesum: -0.0000000
charge: -0.422781 0.203171 -0.178070 -0.231708 -0.163680 0.212674 0.152695 -0.048352 -0.130497 -0.347593 0.305592 0.246658 -0.250056 -0.232288 -0.370483 0.237284 -0.269326 -0.233519 -0.379806 0.203078 -0.045447 -0.083837 0.152014 -0.288108 -0.155459 -0.141963 -0.160427 -0.252337 -0.036821 -0.353110 0.136652 0.148039 0.145463 0.150117 0.147473 0.140666 0.139341 0.143650 -0.355208 0.094429 0.156672 0.145831 0.148369 0.134584 0.144814 0.143433 0.145816 0.150976 0.140844 0.158449 0.137840 0.126705 0.131299 0.152758 0.153490
charge: -0.262411 -0.237452 -0.126077 -0.085251 -0.084165 -0.141955 0.154214 -0.219873 -0.156814 -0.158229 -0.171387 -0.445646 0.271302 -0.307803 0.105802 -0.431396 0.264692 -0.306292 0.106911 -0.098129 -0.131712 -0.022768 -0.137231 -0.104606 -0.152261 -0.153249 -0.151132 -0.099964 -0.139994 0.182216 0.129581 0.135253 0.134073 0.154152 0.157387 0.150415 0.149852 0.147738 -0.131261 0.156816 0.156913 0.145967 0.119209 0.116011 0.117190 0.117724 0.118815 0.119658 0.173221 0.161667 0.151217 0.159456 0.166064 0.118600 0.114941
qa: -0.4228 0.2032 -0.1781 -0.2317 -0.1637 0.2127 0.1527 -0.0484 -0.1305 -0.3476 0.3056 0.2467 -0.2501 -0.2323 -0.3705 0.2373 -0.2693 -0.2335 -0.3798 0.2031 -0.0454 -0.0838 0.1520 -0.2881 -0.1555 -0.1420 -0.1604 -0.2523 -0.0368 -0.3531 0.1367 0.1480 0.1455 0.1501 0.1475 0.1407 0.1393 0.1436 -0.3552 0.0944 0.1567 0.1458 0.1484 0.1346 0.1448 0.1434 0.1458 0.1510 0.1408 0.1584 0.1378 0.1267 0.1313 0.1528 0.1535
va: 3.8656 3.8323 3.8902 4.0490 3.9106 3.4477 0.9771 3.9936 4.1061 4.0816 3.6057 4.3151 2.1081 3.8789 2.1336 4.2480 2.1310 3.8651 2.1267 4.0049 4.1304 3.4303 3.5638 3.9629 3.9324 3.8637 3.9211 3.9433 4.0013 3.0251 0.9689 0.9629 0.9722 0.9679 0.9722 0.9700 0.9697 0.9660 3.8397 0.9704 0.9766 0.9754 0.9665 0.9644 0.9687 0.9667 0.9665 0.9657 0.9829 0.9541 0.9787 0.9746 0.9608 0.9752 0.9730
dispersion: -0.033797310 hartree
energy: -1323.424652482834 hartree
dipole: 0.03038 0.05121 0.08159 1.85562 -1.55183 0.30379 -0.64705 0.17269 -0.47436
magnitude: 0.56918 au
magnitude: 1.44673 debye
