program: Orca
programVersion: 6.0.1
elementType: C C C C C C H C C C C C O C O C O C O C C C C C C C C C C N H H H H H H H H C H H H H H H H H H H H H H H H H
charge: 0
multiplicity: 3
keywords: UKS wB97X-D3 def2-TZVP def2/J RIJCOSX CPCM(Toluene) TightOpt SlowConv TightSCF Freq
frequency: 0.00 0.00 0.00 0.00 0.00 0.00 15.38 19.69 44.77 49.54 54.16 65.84 74.07 78.07 89.29 102.66 107.68 120.18 131.51 151.26 161.85 169.76 171.62 181.68 202.28 219.83 227.71 244.99 250.98 267.00 285.88 302.90 318.83 321.35 335.29 350.70 354.96 399.97 418.75 434.79 437.83 445.85 498.23 515.08 517.54 527.71 580.20 599.95 613.70 627.21 637.91 657.00 689.77 691.72 703.89 719.15 740.91 761.53 782.11 785.85 792.93 821.96 836.51 837.44 840.84 849.49 862.27 889.71 912.90 926.36 951.81 965.31 970.91 988.64 991.14 996.69 1000.00 1001.58 1009.60 1026.06 1036.07 1050.89 1051.55 1054.22 1059.22 1075.18 1107.91 1115.33 1128.19 1147.58 1166.59 1168.18 1171.85 1179.63 1181.43 1191.81 1202.10 1212.09 1222.85 1226.18 1241.32 1243.67 1257.73 1269.56 1280.30 1291.04 1301.09 1309.77 1316.74 1322.44 1332.44 1334.34 1340.10 1349.15 1362.90 1365.75 1402.33 1407.30 1457.25 1461.34 1462.77 1470.09 1477.47 1479.80 1481.43 1483.11 1484.70 1485.16 1490.79 1491.56 1495.44 1501.39 1551.20 1589.08 1598.30 1606.45 1620.54 1733.05 1803.80 1825.62 3059.50 3072.69 3078.30 3079.88 3089.97 3105.26 3125.16 3148.39 3158.23 3158.34 3159.42 3160.41 3162.76 3163.25 3193.22 3194.74 3195.71 3197.62 3200.37 3204.01 3218.15 3218.35 3226.16 3229.93 3242.84
frequency: 15.38 19.69 44.77 49.54 54.16 65.84 74.07 78.07 89.29 102.66 107.68 120.18 131.51 151.26 161.85 169.76 171.62 181.68 202.28 219.83 227.71 244.99 250.98 267.00 285.88 302.90 318.83 321.35 335.29 350.70 354.96 399.97 418.75 434.79 437.83 445.85 498.23 515.08 517.54 527.71 580.20 599.95 613.70 627.21 637.91 657.00 689.77 691.72 703.89 719.15 740.91 761.53 782.11 785.85 792.93 821.96 836.51 837.44 840.84 849.49 862.27 889.71 912.90 926.36 951.81 965.31 970.91 988.64 991.14 996.69 1000.00 1001.58 1009.60 1026.06 1036.07 1050.89 1051.55 1054.22 1059.22 1075.18 1107.91 1115.33 1128.19 1147.58 1166.59 1168.18 1171.85 1179.63 1181.43 1191.81 1202.10 1212.09 1222.85 1226.18 1241.32 1243.67 1257.73 1269.56 1280.30 1291.04 1301.09 1309.77 1316.74 1322.44 1332.44 1334.34 1340.10 1349.15 1362.90 1365.75 1402.33 1407.30 1457.25 1461.34 1462.77 1470.09 1477.47 1479.80 1481.43 1483.11 1484.70 1485.16 1490.79 1491.56 1495.44 1501.39 1551.20 1589.08 1598.30 1606.45 1620.54 1733.05 1803.80 1825.62 3059.50 3072.69 3078.30 3079.88 3089.97 3105.26 3125.16 3148.39 3158.23 3158.34 3159.42 3160.41 3162.76 3163.25 3193.22 3194.74 3195.71 3197.62 3200.37 3204.01 3218.15 3218.35 3226.16 3229.93 3242.84
formula: C25H25NO4
InChI: InChI=1/C25H25NO4/c1-5-16-14-25(23(27)29-3,24(28)30-4)21-20(16)19(17-9-7-6-8-10-17)13-18-12-11-15(2)26-22(18)21/h5-13,16,20-21H,1,14H2,2-4H3
55 atoms
C  1.481294 4.767637 0.745638
C  0.401898 3.743834 0.581231
C  -0.931484 4.101772 0.3326
C  -1.876524 3.123018 0.204626
C  -1.506379 1.755127 0.325296
C  -2.429465 0.728183 0.249102
H  -1.628306 -3.373299 0.621803
C  -1.44618 -0.846137 -2.377942
C  -0.308575 -1.177708 -1.461335
C  0.934541 -0.317616 -1.731145
C  1.614829 -0.161081 -0.368029
C  2.687123 0.927467 -0.37782
O  3.387381 0.905238 0.754672
C  4.405063 1.896981 0.881937
O  2.928074 1.648234 -1.308288
C  2.34124 -1.452555 0.02817
O  3.293845 -1.740397 -0.856216
C  4.082325 -2.90129 -0.581444
O  2.107899 -2.126539 0.996189
C  0.408344 0.073952 0.575692
C  -0.605521 -0.98711 0.077436
C  -2.020038 -0.679366 0.434029
C  -2.921502 -1.646773 0.913099
C  -4.225352 -1.285272 1.357712
C  -5.114532 -2.228994 1.824307
C  -4.766948 -3.576948 1.861225
C  -3.499602 -3.96417 1.422937
C  -2.596894 -3.033252 0.964058
C  -0.112689 1.493737 0.522053
N  0.77083 2.46107 0.660651
H  1.087395 5.780776 0.67401
H  2.243884 4.632038 -0.025102
H  1.971714 4.649894 1.714439
H  -1.200463 5.147612 0.249999
H  -2.916199 3.371141 0.02249
H  -3.455928 0.966038 -0.002281
H  -2.89754 -1.437139 -3.783528
H  -1.806235 -2.779493 -3.126654
C  -2.081075 -1.7293 -3.134018
H  -0.062371 -2.232276 -1.610349
H  0.644424 0.678668 -2.072687
H  1.591945 -0.741174 -2.487933
H  4.852733 1.740119 1.859351
H  3.963053 2.891279 0.821492
H  5.151656 1.780315 0.096688
H  3.453993 -3.791287 -0.567043
H  4.585775 -2.796307 0.379026
H  4.807563 -2.961747 -1.38776
H  0.690121 -0.145337 1.607526
H  -0.319257 -1.915053 0.562883
H  -4.523995 -0.245452 1.346603
H  -6.094723 -1.91433 2.163361
H  -5.471896 -4.315832 2.221462
H  -3.220307 -5.011268 1.440494
H  -1.747771 0.199133 -2.411044
totalener: -1323.33154460703304 hartree
nucrepener: 2995.17520399490650 hartree
electener: -4318.49204132598970 hartree
oneelecener: -7757.37011285301560 hartree
twoeener: 3438.87807152702590 hartree
cpcmener: -0.01468619476967 hartree
kineticenergy: 1316.51399508072063 hartree
xcener: -128.286305665252 hartree
s2: 2.079153
dispersion: -0.033169375 hartree
s2: 2.085968
dispersion: -0.033560349 hartree
s2: 2.093931
dispersion: -0.033823313 hartree
s2: 2.097934
dispersion: -0.033754297 hartree
s2: 2.100736
dispersion: -0.033897745 hartree
s2: 2.101466
dispersion: -0.033643844 hartree
s2: 2.100180
dispersion: -0.033590508 hartree
s2: 2.098702
dispersion: -0.033390034 hartree
s2: 2.099679
dispersion: -0.033361650 hartree
s2: 2.099737
dispersion: -0.033262353 hartree
s2: 2.099741
dispersion: -0.033152643 hartree
s2: 2.099744
dispersion: -0.033128680 hartree
s2: 2.099704
dispersion: -0.033138749 hartree
s2: 2.099864
dispersion: -0.033137192 hartree
s2: 2.099947
dispersion: -0.033151907 hartree
s2: 2.099945
dispersion: -0.033177331 hartree
s2: 2.099808
dispersion: -0.033181893 hartree
s2: 2.099721
dispersion: -0.033183885 hartree
s2: 2.099642
dispersion: -0.033185531 hartree
s2: 2.099624
dispersion: -0.033186196 hartree
s2: 2.099690
dispersion: -0.033182089 hartree
s2: 2.099688
dispersion: -0.033185897 hartree
s2: 2.099706
dispersion: -0.033184871 hartree
elementType: C H O N
s2: 2.099716
energy: -524.8645 -524.6237 -523.2538 -522.9768 -392.3531 -283.4856 -283.3353 -281.0923 -281.0725 -280.9395 -280.9236 -280.7925 -280.2720 -280.2480 -280.2000 -280.1822 -280.1052 -280.0430 -279.9972 -279.9873 -279.8292 -279.7457 -279.7424 -279.7305 -279.7082 -279.6967 -279.6694 -279.6663 -279.4483 -279.3630 -33.8393 -33.4783 -31.2457 -31.0122 -29.3111 -27.3622 -26.7318 -26.0049 -25.1255 -25.0937 -24.5463 -23.8072 -23.5885 -23.2918 -23.1505 -22.7905 -22.4925 -21.7720 -20.6397 -20.4169 -19.7770 -19.6466 -19.2547 -19.0402 -18.8062 -18.3064 -18.0361 -17.6023 -17.3775 -17.1594 -17.0504 -16.5082 -16.4076 -16.2406 -16.0577 -15.8741 -15.7692 -15.4668 -15.2804 -15.0989 -14.9385 -14.8807 -14.6852 -14.5775 -14.4138 -14.3380 -14.1316 -13.8959 -13.7719 -13.7297 -13.6200 -13.5504 -13.3668 -13.2196 -12.9823 -12.8984 -12.8583 -12.7226 -12.5611 -12.3501 -12.2230 -12.1811 -11.9781 -11.8532 -11.6415 -11.3403 -11.2465 -11.0331 -10.9287 -10.6941 -10.4209 -10.0810 -9.9404 -9.6016 -9.5911 -9.5200 -7.9918 -5.8958 0.9731 1.6067 1.8064 2.0396 2.2947 2.7024 2.8898 3.0190 3.4348 3.5964 3.7926 electronvolt
energy: -524.8642 -524.6234 -523.2534 -522.9776 -392.4108 -283.4858 -283.3351 -281.0923 -280.9902 -280.9236 -280.8479 -280.7886 -280.2438 -280.2268 -280.1291 -280.1010 -280.0851 -279.9983 -279.9774 -279.9463 -279.8694 -279.7302 -279.7140 -279.7113 -279.6958 -279.6750 -279.6671 -279.6251 -279.4539 -279.3621 -33.8386 -33.4780 -31.2449 -31.0131 -29.2419 -27.2244 -26.6116 -25.7672 -25.0237 -24.9749 -24.3669 -23.7500 -23.4930 -23.1466 -23.0902 -22.7074 -22.4154 -21.5450 -20.5345 -20.1196 -19.6797 -19.5923 -19.1625 -18.9369 -18.7635 -18.2344 -18.0194 -17.5431 -17.3307 -17.0798 -16.9436 -16.4847 -16.3176 -16.2005 -15.9513 -15.8631 -15.7595 -15.3931 -15.2307 -15.0364 -14.8143 -14.7529 -14.5468 -14.4895 -14.3723 -14.2522 -14.0558 -13.7662 -13.7103 -13.6400 -13.4880 -13.3605 -13.1674 -13.1029 -12.9311 -12.8421 -12.7586 -12.6354 -12.4561 -12.2810 -12.1618 -12.0970 -11.8871 -11.7007 -11.5899 -11.2337 -11.0421 -11.0047 -10.6603 -10.5256 -10.0637 -9.8399 -9.6004 -9.5559 -9.2880 -9.2337 -1.5917 0.4055 1.3593 1.8797 2.0526 2.2586 2.5747 2.8366 3.0277 3.3688 3.5879 electronvolt
chargesum: -0.0000000
charge: -0.425607 0.228515 -0.212041 -0.193408 0.089183 -0.369036 0.143827 -0.230747 0.007173 -0.337382 0.412531 0.266130 -0.258891 -0.231479 -0.370641 0.231084 -0.268136 -0.229832 -0.375249 0.097565 -0.058050 0.169989 0.093308 -0.224110 -0.152673 -0.150139 -0.146800 -0.255627 -0.019908 -0.352572 0.136618 0.154157 0.146300 0.148618 0.147070 0.168366 0.145451 0.138010 -0.307683 0.094454 0.147683 0.149289 0.147830 0.132522 0.145408 0.143425 0.146475 0.151201 0.130595 0.140488 0.139041 0.138622 0.144145 0.139526 0.155412
charge: -0.260550 -0.229358 -0.131704 -0.073692 -0.143524 -0.049084 0.151628 -0.177066 -0.181569 -0.156294 -0.169199 -0.454614 0.265528 -0.301405 0.104944 -0.434808 0.265009 -0.295841 0.108638 -0.102678 -0.133275 -0.052609 -0.133110 -0.099571 -0.153264 -0.146363 -0.152148 -0.097516 -0.123217 0.197685 0.128916 0.135296 0.134011 0.154378 0.155801 0.152642 0.124953 0.125707 -0.210215 0.163058 0.157327 0.146820 0.117057 0.113736 0.115207 0.116059 0.117362 0.118093 0.178164 0.168583 0.150444 0.149375 0.146420 0.149683 0.150151
qa: -0.4256 0.2285 -0.2120 -0.1934 0.0892 -0.3690 0.1438 -0.2307 0.0072 -0.3374 0.4125 0.2661 -0.2589 -0.2315 -0.3706 0.2311 -0.2681 -0.2298 -0.3752 0.0976 -0.0581 0.1700 0.0933 -0.2241 -0.1527 -0.1501 -0.1468 -0.2556 -0.0199 -0.3526 0.1366 0.1542 0.1463 0.1486 0.1471 0.1684 0.1455 0.1380 -0.3077 0.0945 0.1477 0.1493 0.1478 0.1325 0.1454 0.1434 0.1465 0.1512 0.1306 0.1405 0.1390 0.1386 0.1441 0.1395 0.1554
va: 3.8746 3.7833 3.9554 3.9886 3.8422 3.8727 0.9781 3.8574 3.9903 4.0945 3.4418 4.3148 2.1003 3.8810 2.1357 4.2748 2.1365 3.8647 2.1321 4.2190 3.8376 3.3563 3.8509 3.9232 3.9503 3.8771 3.9169 3.9490 4.0224 3.0224 0.9706 0.9647 0.9654 0.9695 0.9747 0.9641 0.9723 0.9759 3.9572 0.9760 0.9784 0.9768 0.9672 0.9644 0.9689 0.9664 0.9670 0.9662 0.9801 0.9605 0.9742 0.9695 0.9660 0.9690 0.9590
dispersion: -0.033185061 hartree
energy: -1323.432458454482 hartree
dipole: 1.018937511 -1.031691209 -0.012753698 -0.029974239 0.314362130 0.284387892 -3.933789134 3.932042812 -0.001746322
dipolemethod: SCF
magnitude: 0.284679081 au
magnitude: 0.723596719 debye
temp: 298.15 k
press: 1.00 atm
zeropoint: 0.44948330 hartree
thermalvibcorrection: 0.02485181 hartree
thermalrotcorrection: 0.00141627 hartree
thermaltrasncorrection: 0.00141627 hartree
thermaltotal: -1322.95529080 hartree
thermalcorr: 0.02768436 hartree
nonthermalcorr: 0.44948330 hartree
totalcorr: 0.47716766 hartree
thermalcorrenthalpy: 0.00094421 hartree
totalenthalpy: -1322.95434659 hartree
vibrat: 0.04461569 hartree
rotat: 0.01709345 hartree
transl: 0.02084687 hartree
total: 0.08359330 hartree
totalentropycorr: -0.08359330 hartree
gibbsenthalpy: -1323.03793989 hartree
gibbsminuselec: 0.39451856 hartree
