program: Orca
programVersion: 6.0.1
elementType: C C C C C C H C C C C C O C O C O C O C C C C C C C C C C N H H H H H H H H C H H H H H H H H H H H H H H H H
charge: 0
multiplicity: 3
keywords: UKS wB97X-D3 def2-TZVP def2/J RIJCOSX CPCM(Toluene) TightOpt SlowConv TightSCF Freq KeepDens
frequency: 0.00 0.00 0.00 0.00 0.00 0.00 22.25 35.81 42.92 49.39 51.70 68.07 79.96 82.11 93.55 95.10 101.81 116.29 130.02 152.03 160.08 163.98 170.95 177.48 202.76 214.68 225.24 238.09 274.26 283.69 301.47 310.05 322.36 341.20 350.64 371.35 414.72 423.15 433.88 439.30 465.06 480.35 497.49 514.05 546.97 565.90 613.02 620.73 627.21 634.03 642.93 683.85 694.87 696.32 715.31 752.22 778.91 787.94 800.21 805.56 829.10 836.61 841.46 846.36 860.09 876.03 884.76 917.50 922.79 931.86 957.00 977.30 989.90 996.20 998.48 1005.74 1008.29 1010.58 1017.19 1022.09 1052.16 1055.23 1061.10 1066.10 1071.38 1109.90 1113.43 1122.02 1145.12 1153.56 1164.99 1169.96 1178.24 1180.37 1187.09 1192.55 1201.75 1211.96 1218.07 1222.20 1229.63 1232.22 1234.08 1265.91 1276.36 1285.49 1289.84 1295.35 1301.72 1304.06 1316.84 1322.33 1325.73 1335.71 1349.60 1355.02 1367.81 1390.30 1410.07 1453.02 1458.42 1461.59 1472.78 1476.75 1479.68 1482.76 1484.40 1485.60 1489.73 1491.02 1491.53 1502.70 1517.80 1525.29 1609.96 1629.53 1652.87 1675.92 1804.54 1827.43 3065.43 3070.20 3078.77 3079.75 3106.19 3110.16 3129.56 3130.56 3135.38 3155.21 3157.28 3159.74 3160.69 3160.85 3162.94 3192.01 3193.62 3195.22 3195.26 3199.76 3214.36 3218.42 3219.55 3224.93 3260.26
frequency: 22.25 35.81 42.92 49.39 51.70 68.07 79.96 82.11 93.55 95.10 101.81 116.29 130.02 152.03 160.08 163.98 170.95 177.48 202.76 214.68 225.24 238.09 274.26 283.69 301.47 310.05 322.36 341.20 350.64 371.35 414.72 423.15 433.88 439.30 465.06 480.35 497.49 514.05 546.97 565.90 613.02 620.73 627.21 634.03 642.93 683.85 694.87 696.32 715.31 752.22 778.91 787.94 800.21 805.56 829.10 836.61 841.46 846.36 860.09 876.03 884.76 917.50 922.79 931.86 957.00 977.30 989.90 996.20 998.48 1005.74 1008.29 1010.58 1017.19 1022.09 1052.16 1055.23 1061.10 1066.10 1071.38 1109.90 1113.43 1122.02 1145.12 1153.56 1164.99 1169.96 1178.24 1180.37 1187.09 1192.55 1201.75 1211.96 1218.07 1222.20 1229.63 1232.22 1234.08 1265.91 1276.36 1285.49 1289.84 1295.35 1301.72 1304.06 1316.84 1322.33 1325.73 1335.71 1349.60 1355.02 1367.81 1390.30 1410.07 1453.02 1458.42 1461.59 1472.78 1476.75 1479.68 1482.76 1484.40 1485.60 1489.73 1491.02 1491.53 1502.70 1517.80 1525.29 1609.96 1629.53 1652.87 1675.92 1804.54 1827.43 3065.43 3070.20 3078.77 3079.75 3106.19 3110.16 3129.56 3130.56 3135.38 3155.21 3157.28 3159.74 3160.69 3160.85 3162.94 3192.01 3193.62 3195.22 3195.26 3199.76 3214.36 3218.42 3219.55 3224.93 3260.26
formula: C25H25NO4
InChI: InChI=1/C25H25NO4/c1-13-10-11-16-18-14(2)17-12-25(23(27)29-3,24(28)30-4)21(22(16)26-13)20(17)19(18)15-8-6-5-7-9-15/h5-11,14,17-18,20-21H,2,12H2,1,3-4H3
55 atoms
C  0.791553 4.333472 1.568861
C  -0.017111 3.280739 0.870012
C  -1.204967 3.582675 0.215605
C  -1.896136 2.567402 -0.419276
C  -1.392709 1.276849 -0.403539
C  -2.126368 0.111072 -1.035778
H  -1.376087 -3.003702 1.666335
C  -1.434694 -0.368191 -2.355393
C  -0.216373 -1.189824 -1.844933
C  1.14736 -0.486418 -1.980931
C  1.722139 -0.395783 -0.556363
C  2.662976 0.794866 -0.378665
O  3.335677 0.692524 0.764141
C  4.183091 1.791903 1.098598
O  2.794152 1.697275 -1.160881
C  2.525364 -1.64934 -0.198774
O  3.573431 -1.77831 -1.01059
C  4.437242 -2.889597 -0.758886
O  2.270207 -2.423893 0.684729
C  0.451397 -0.313911 0.326426
C  -0.46459 -1.382349 -0.322677
C  -1.903992 -1.055215 -0.12195
C  -2.797468 -1.605841 0.816712
C  -4.137172 -1.153836 0.921313
C  -5.005639 -1.698796 1.843081
C  -4.58554 -2.712493 2.701134
C  -3.273061 -3.17242 2.620906
C  -2.394075 -2.636331 1.703635
C  -0.185996 1.06407 0.268381
N  0.466081 2.039374 0.892892
H  0.24002 5.268719 1.659357
H  1.708371 4.52899 1.007478
H  1.080799 3.991198 2.563019
H  -1.584143 4.596959 0.214906
H  -2.835031 2.773189 -0.922569
H  -2.934922 -3.956723 3.288223
H  -6.023882 -1.331528 1.898625
H  -5.271396 -3.135587 3.424706
C  -2.370976 -1.172047 -3.179512
H  -0.198589 -2.154063 -2.352313
H  1.034157 0.528904 -2.361231
H  1.825419 -1.004454 -2.656523
H  4.636863 1.535449 2.051656
H  3.588967 2.700732 1.191293
H  4.94791 1.930769 0.334999
H  3.888419 -3.826075 -0.851725
H  4.864068 -2.815815 0.240959
H  5.21842 -2.829162 -1.511209
H  0.686007 -0.547055 1.36487
H  -0.169473 -2.368641 0.025942
H  -4.486494 -0.366322 0.265581
H  -1.108074 0.506062 -2.925521
H  -3.166507 0.38242 -1.20931
H  -3.074846 -0.683811 -3.842084
H  -2.494161 -2.233508 -2.999208
totalener: -1323.32477725098124 hartree
nucrepener: 3028.65915906565124 hartree
electener: -4351.96905132418942 hartree
oneelecener: -7824.56503503999011 hartree
twoeener: 3472.59598371580068 hartree
cpcmener: -0.01485987094760 hartree
kineticenergy: 1315.96094634261544 hartree
xcener: -128.214396238611 hartree
s2: 2.025311
dispersion: -0.033557499 hartree
s2: 2.025856
dispersion: -0.033827493 hartree
s2: 2.028324
dispersion: -0.033970859 hartree
s2: 2.035178
dispersion: -0.033739946 hartree
s2: 2.044036
dispersion: -0.033606078 hartree
s2: 2.052878
dispersion: -0.032994795 hartree
s2: 2.056083
dispersion: -0.033075710 hartree
s2: 2.057295
dispersion: -0.033043741 hartree
s2: 2.057635
dispersion: -0.033090259 hartree
s2: 2.057429
dispersion: -0.033007954 hartree
s2: 2.056937
dispersion: -0.032987341 hartree
s2: 2.056356
dispersion: -0.033058162 hartree
s2: 2.055746
dispersion: -0.033097309 hartree
s2: 2.055677
dispersion: -0.033114137 hartree
s2: 2.055668
dispersion: -0.033117026 hartree
s2: 2.055692
dispersion: -0.033128077 hartree
s2: 2.055736
dispersion: -0.033139114 hartree
s2: 2.055762
dispersion: -0.033156600 hartree
s2: 2.055778
dispersion: -0.033206085 hartree
s2: 2.055793
dispersion: -0.033226885 hartree
s2: 2.055773
dispersion: -0.033216253 hartree
s2: 2.055657
dispersion: -0.033212409 hartree
s2: 2.055600
dispersion: -0.033223359 hartree
s2: 2.055605
dispersion: -0.033225437 hartree
s2: 2.055655
dispersion: -0.033216007 hartree
s2: 2.055648
dispersion: -0.033226615 hartree
s2: 2.055653
dispersion: -0.033226168 hartree
dispersion: -0.033225613 hartree
s2: 2.055659
dispersion: -0.033225501 hartree
elementType: C H O N
energy: -524.8325 -524.6951 -523.2233 -523.0715 -392.2754 -283.4542 -283.3583 -281.0797 -280.9439 -280.8445 -280.8155 -280.7854 -280.1981 -280.1218 -280.1144 -280.0808 -280.0576 -280.0237 -279.9514 -279.8326 -279.8183 -279.7673 -279.7431 -279.7095 -279.6885 -279.6708 -279.6621 -279.6475 -279.6349 -279.3945 -33.8253 -33.5307 -31.2145 -31.0853 -29.2155 -27.7138 -26.6695 -26.1145 -25.0714 -24.8586 -24.3915 -23.9359 -23.5299 -23.2221 -23.0951 -22.5372 -22.4166 -21.7365 -20.5757 -20.4655 -19.7070 -19.6612 -19.3773 -19.0595 -18.8235 -18.0990 -18.0120 -17.6451 -17.5917 -17.1766 -16.9656 -16.4616 -16.3725 -16.2216 -15.9826 -15.8634 -15.7630 -15.6597 -15.1878 -15.0518 -14.9553 -14.7304 -14.6833 -14.4661 -14.3603 -14.1990 -14.1104 -13.9398 -13.7868 -13.7174 -13.5212 -13.4362 -13.1635 -13.0175 -12.9949 -12.8869 -12.7824 -12.7019 -12.4434 -12.4035 -12.1207 -12.0286 -11.8558 -11.6850 -11.4815 -11.3556 -11.2951 -11.0447 -11.0256 -10.6270 -10.3601 -10.1374 -10.0349 -9.5822 -9.5354 -9.1075 -8.0282 -6.8311 1.0659 1.6106 1.7612 2.0841 2.3044 2.6753 3.0875 3.4560 3.4748 3.8393 3.8922 electronvolt
energy: -524.8325 -524.6948 -523.2232 -523.0710 -392.2766 -283.4541 -283.3574 -281.0797 -280.9439 -280.8432 -280.8124 -280.7851 -280.1787 -280.1177 -280.0928 -280.0833 -280.0643 -279.9636 -279.8560 -279.8465 -279.8033 -279.7677 -279.6933 -279.6799 -279.6704 -279.6402 -279.6192 -279.5821 -279.4745 -279.3947 -33.8248 -33.5300 -31.2142 -31.0840 -29.2019 -27.5593 -26.5814 -26.0133 -25.0116 -24.7989 -24.1657 -23.8459 -23.4420 -23.1868 -23.0385 -22.4987 -22.0460 -21.6103 -20.4250 -20.1620 -19.6334 -19.4559 -19.2903 -18.9264 -18.8145 -18.0140 -17.9717 -17.5885 -17.4972 -17.1131 -16.9388 -16.3818 -16.3449 -16.1711 -15.9371 -15.8468 -15.7547 -15.5413 -15.0928 -14.9687 -14.8856 -14.6808 -14.6106 -14.4353 -14.2598 -14.1042 -13.9315 -13.9029 -13.7307 -13.6665 -13.4719 -13.3361 -12.9838 -12.9532 -12.8986 -12.8706 -12.6797 -12.6538 -12.3784 -12.3104 -12.0787 -11.9565 -11.7115 -11.5849 -11.3909 -11.2831 -11.2288 -11.0295 -10.9731 -10.5897 -10.1363 -10.1007 -9.5918 -9.5192 -9.2422 -8.9283 -0.2531 0.4179 1.1249 1.6984 1.9342 2.0979 2.5649 3.0396 3.1805 3.4708 3.4915 electronvolt
chargesum: -0.0000000
charge: -0.417011 0.206595 -0.182989 -0.199025 -0.111449 0.328966 0.151796 -0.098275 -0.081526 -0.344241 0.300590 0.245870 -0.252376 -0.230918 -0.370205 0.242178 -0.273038 -0.230156 -0.380069 0.193127 -0.016820 -0.183109 0.166398 -0.277590 -0.150372 -0.144078 -0.150675 -0.262038 -0.080367 -0.362875 0.134370 0.146363 0.144098 0.148149 0.144636 0.139305 0.137561 0.142858 -0.407904 0.092229 0.150392 0.142717 0.147896 0.135322 0.145720 0.143888 0.146141 0.149959 0.136670 0.152948 0.134103 0.103981 0.134240 0.151910 0.166131
charge: -0.258016 -0.239659 -0.124961 -0.083671 -0.083974 -0.129319 0.152507 -0.222173 -0.145346 -0.155445 -0.169027 -0.448113 0.268933 -0.298748 0.106810 -0.435071 0.261668 -0.296825 0.107587 -0.098737 -0.135598 -0.017891 -0.138562 -0.100037 -0.152452 -0.150079 -0.151159 -0.096968 -0.139463 0.185545 0.128232 0.133595 0.132723 0.153092 0.156570 0.149508 0.148944 0.146330 -0.145680 0.155486 0.153362 0.144401 0.117489 0.114444 0.115405 0.116024 0.117215 0.117808 0.172906 0.160845 0.149502 0.160317 0.161965 0.111451 0.116309
qa: -0.4170 0.2066 -0.1830 -0.1990 -0.1114 0.3290 0.1518 -0.0983 -0.0815 -0.3442 0.3006 0.2459 -0.2524 -0.2309 -0.3702 0.2422 -0.2730 -0.2302 -0.3801 0.1931 -0.0168 -0.1831 0.1664 -0.2776 -0.1504 -0.1441 -0.1507 -0.2620 -0.0804 -0.3629 0.1344 0.1464 0.1441 0.1481 0.1446 0.1393 0.1376 0.1429 -0.4079 0.0922 0.1504 0.1427 0.1479 0.1353 0.1457 0.1439 0.1461 0.1500 0.1367 0.1529 0.1341 0.1040 0.1342 0.1519 0.1661
va: 3.8692 3.8363 3.9025 4.0181 3.9583 3.3865 0.9803 4.0658 4.1208 4.0998 3.6026 4.3138 2.1065 3.8799 2.1331 4.2501 2.1309 3.8654 2.1263 3.9990 4.1375 3.5595 3.5342 3.9709 3.9315 3.8676 3.9146 3.9641 4.0555 3.0280 0.9697 0.9631 0.9726 0.9692 0.9734 0.9703 0.9704 0.9664 3.8564 0.9738 0.9813 0.9767 0.9671 0.9651 0.9683 0.9669 0.9669 0.9665 0.9868 0.9546 0.9822 0.9810 0.9578 0.9760 0.9639
dispersion: -0.033226115 hartree
energy: -1323.444796378740 hartree
dipole: -0.008079358 0.010828073 0.002748715 2.235154276 -1.951240523 0.283913753 -1.421119923 1.121139528 -0.299980395
dipolemethod: SCF
magnitude: 0.413040932 au
magnitude: 1.049866615 debye
temp: 298.15 k
press: 1.00 atm
zeropoint: 0.45063817 hartree
thermalvibcorrection: 0.02435054 hartree
thermalrotcorrection: 0.00141627 hartree
thermaltrasncorrection: 0.00141627 hartree
thermaltotal: -1322.96697513 hartree
thermalcorr: 0.02718308 hartree
nonthermalcorr: 0.45063817 hartree
totalcorr: 0.47782125 hartree
thermalcorrenthalpy: 0.00094421 hartree
totalenthalpy: -1322.96603092 hartree
vibrat: 0.04346421 hartree
rotat: 0.01703620 hartree
transl: 0.02084687 hartree
total: 0.08238457 hartree
totalentropycorr: -0.08238457 hartree
gibbsenthalpy: -1323.04841548 hartree
gibbsminuselec: 0.39638089 hartree
