program: Orca
programVersion: 6.0.1
elementType: C C C C C C H C C C C C O C O C O C O C C C C C C C C C C N H H H H H H H H C H H H H H H H H H H H H H H H H
charge: 0
multiplicity: 3
keywords: UKS wB97X-D3 def2-TZVP def2/J RIJCOSX CPCM(Toluene) TightOpt SlowConv TightSCF Freq KeepDens
frequency: 0.00 0.00 0.00 0.00 0.00 0.00 21.21 26.46 35.91 40.06 51.84 75.25 86.91 90.38 98.48 101.10 117.92 130.19 152.50 154.89 162.23 168.46 173.18 205.16 223.88 227.32 232.08 250.58 280.25 298.46 306.11 320.36 344.61 351.87 389.54 406.29 416.96 430.43 437.66 442.25 478.13 492.71 518.03 523.46 566.59 573.82 603.79 625.02 631.51 639.22 673.96 694.06 696.24 715.69 751.76 772.02 779.18 785.51 790.61 811.21 835.32 840.65 847.06 859.22 867.01 896.57 913.70 921.12 924.63 953.98 972.44 976.60 997.38 999.14 1002.79 1006.95 1009.29 1012.79 1025.47 1039.93 1057.16 1063.18 1065.09 1066.87 1101.02 1117.56 1125.81 1141.28 1157.70 1170.68 1171.88 1177.04 1178.07 1181.05 1203.81 1205.92 1217.11 1219.83 1227.14 1229.14 1231.15 1246.67 1268.07 1273.15 1283.16 1289.10 1292.32 1297.52 1304.98 1321.05 1325.07 1334.82 1341.63 1355.35 1360.68 1376.93 1381.55 1411.24 1417.28 1453.27 1460.50 1465.47 1472.76 1475.88 1479.40 1482.53 1483.59 1485.14 1489.96 1491.42 1492.93 1498.85 1522.96 1529.10 1611.30 1630.82 1651.53 1678.77 1802.64 1826.15 2975.48 3011.84 3066.02 3067.29 3078.36 3079.42 3107.53 3111.57 3128.34 3135.04 3158.82 3159.70 3160.78 3161.99 3174.99 3186.94 3188.02 3192.80 3193.80 3194.88 3200.48 3217.52 3218.04 3227.48 3230.23
frequency: 21.21 26.46 35.91 40.06 51.84 75.25 86.91 90.38 98.48 101.10 117.92 130.19 152.50 154.89 162.23 168.46 173.18 205.16 223.88 227.32 232.08 250.58 280.25 298.46 306.11 320.36 344.61 351.87 389.54 406.29 416.96 430.43 437.66 442.25 478.13 492.71 518.03 523.46 566.59 573.82 603.79 625.02 631.51 639.22 673.96 694.06 696.24 715.69 751.76 772.02 779.18 785.51 790.61 811.21 835.32 840.65 847.06 859.22 867.01 896.57 913.70 921.12 924.63 953.98 972.44 976.60 997.38 999.14 1002.79 1006.95 1009.29 1012.79 1025.47 1039.93 1057.16 1063.18 1065.09 1066.87 1101.02 1117.56 1125.81 1141.28 1157.70 1170.68 1171.88 1177.04 1178.07 1181.05 1203.81 1205.92 1217.11 1219.83 1227.14 1229.14 1231.15 1246.67 1268.07 1273.15 1283.16 1289.10 1292.32 1297.52 1304.98 1321.05 1325.07 1334.82 1341.63 1355.35 1360.68 1376.93 1381.55 1411.24 1417.28 1453.27 1460.50 1465.47 1472.76 1475.88 1479.40 1482.53 1483.59 1485.14 1489.96 1491.42 1492.93 1498.85 1522.96 1529.10 1611.30 1630.82 1651.53 1678.77 1802.64 1826.15 2975.48 3011.84 3066.02 3067.29 3078.36 3079.42 3107.53 3111.57 3128.34 3135.04 3158.82 3159.70 3160.78 3161.99 3174.99 3186.94 3188.02 3192.80 3193.80 3194.88 3200.48 3217.52 3218.04 3227.48 3230.23
formula: C25H25NO4
InChI: InChI=1/C25H25NO4/c1-14-9-11-18-17-12-10-16-13-25(23(27)29-2,24(28)30-3)21(22(18)26-14)20(16)19(17)15-7-5-4-6-8-15/h4-11,16-17,20-21H,12-13H2,1-3H3
55 atoms
C  1.163889 4.535468 0.780233
C  0.182527 3.461621 0.413296
C  -1.115389 3.75521 0.012304
C  -1.958918 2.712961 -0.317595
C  -1.509153 1.401436 -0.257224
C  -2.4378 0.260826 -0.630285
H  -1.157557 -3.208516 1.383336
C  -1.157545 -0.411828 -2.671585
C  -0.198395 -1.205504 -1.849139
C  1.240776 -0.625571 -1.928885
C  1.70965 -0.419106 -0.478331
C  2.733317 0.711096 -0.354375
O  3.281115 0.708668 0.85896
C  4.218352 1.750059 1.12812
O  3.05107 1.461024 -1.237135
C  2.412312 -1.672448 0.060168
O  3.501036 -1.940118 -0.6589
C  4.281105 -3.060114 -0.233416
O  2.059343 -2.336424 0.99865
C  0.391411 -0.193983 0.299314
C  -0.529489 -1.258108 -0.325372
C  -1.960891 -1.008761 -0.000616
C  -2.759047 -1.85849 0.806555
C  -4.145594 -1.625976 0.998225
C  -4.916485 -2.456948 1.78426
C  -4.352197 -3.557369 2.422881
C  -2.993247 -3.809108 2.25736
C  -2.212927 -2.987534 1.471275
C  -0.190435 1.199354 0.153251
N  0.613242 2.206012 0.486835
H  0.713626 5.526012 0.724896
H  2.02059 4.502354 0.103929
H  1.538028 4.375001 1.792853
H  -1.455323 4.782333 -0.031814
H  -2.981095 2.914858 -0.621943
H  -5.973427 -2.247478 1.902076
H  -4.961026 -4.20529 3.04127
H  -2.535865 -4.657566 2.753082
C  -2.470162 0.059797 -2.160004
H  -2.76177 0.991984 -2.654362
H  1.231432 0.347937 -2.418573
H  1.922872 -1.261475 -2.490098
H  4.551082 1.591237 2.150099
H  3.73102 2.72028 1.033189
H  5.060499 1.694191 0.438855
H  3.685928 -3.972061 -0.2661
H  4.645828 -2.900818 0.780969
H  5.111353 -3.122368 -0.931071
H  0.547208 -0.385903 1.362393
H  -0.204308 -2.224959 0.044065
H  -4.623587 -0.786049 0.51199
H  -3.265559 -0.667187 -2.388709
H  -3.438802 0.532082 -0.298734
H  -0.931643 -0.294149 -3.725759
H  -0.187836 -2.236082 -2.226333
totalener: -1323.10573888989688 hartree
nucrepener: 3020.63102901545290 hartree
electener: -4343.72076452774854 hartree
oneelecener: -7808.07647593326874 hartree
twoeener: 3464.35571140552065 hartree
cpcmener: -0.01600285305855 hartree
kineticenergy: 1315.83084239892969 hartree
xcener: -128.147407226410 hartree
s2: 2.024886
dispersion: -0.033226243 hartree
s2: 2.024294
dispersion: -0.033385451 hartree
s2: 2.024194
dispersion: -0.033544095 hartree
s2: 2.025292
dispersion: -0.033699740 hartree
s2: 2.028263
dispersion: -0.033889954 hartree
s2: 2.032251
dispersion: -0.034022162 hartree
s2: 2.037447
dispersion: -0.033989671 hartree
s2: 2.043833
dispersion: -0.034019928 hartree
s2: 2.049214
dispersion: -0.033415186 hartree
s2: 2.051724
dispersion: -0.033500454 hartree
s2: 2.054405
dispersion: -0.033621327 hartree
s2: 2.056190
dispersion: -0.033537243 hartree
s2: 2.056293
dispersion: -0.033415378 hartree
s2: 2.055582
dispersion: -0.033449697 hartree
s2: 2.055209
dispersion: -0.033528327 hartree
s2: 2.054777
dispersion: -0.033548756 hartree
s2: 2.054466
dispersion: -0.033565494 hartree
s2: 2.054465
dispersion: -0.033547843 hartree
s2: 2.054828
dispersion: -0.033510186 hartree
s2: 2.055291
dispersion: -0.033459039 hartree
s2: 2.055566
dispersion: -0.033441883 hartree
s2: 2.055602
dispersion: -0.033419214 hartree
s2: 2.055425
dispersion: -0.033403420 hartree
s2: 2.055048
dispersion: -0.033368610 hartree
s2: 2.054674
dispersion: -0.033333252 hartree
s2: 2.054496
dispersion: -0.033298599 hartree
s2: 2.054533
dispersion: -0.033270689 hartree
s2: 2.054885
dispersion: -0.033256524 hartree
s2: 2.054961
dispersion: -0.033246828 hartree
s2: 2.054959
dispersion: -0.033242735 hartree
s2: 2.054946
dispersion: -0.033239697 hartree
s2: 2.054939
dispersion: -0.033237292 hartree
s2: 2.054936
dispersion: -0.033236540 hartree
s2: 2.054934
dispersion: -0.033234945 hartree
elementType: C H O N
s2: 2.054933
energy: -524.8222 -524.6082 -523.2157 -522.9744 -392.2235 -283.4500 -283.3061 -281.0710 -280.9008 -280.8353 -280.8007 -280.7665 -280.1294 -280.0890 -280.0766 -280.0524 -280.0403 -280.0379 -279.9301 -279.8171 -279.7606 -279.7465 -279.6977 -279.6647 -279.6631 -279.6631 -279.6496 -279.6349 -279.6178 -279.3869 -33.8069 -33.4614 -31.2054 -31.0025 -29.1773 -27.4563 -26.6644 -26.1123 -25.0066 -24.8592 -24.4164 -24.1203 -23.5176 -23.3026 -23.0710 -22.5892 -22.2074 -21.9574 -20.5211 -20.4133 -19.8195 -19.6407 -19.1564 -19.0087 -18.7597 -18.5255 -17.9886 -17.6528 -17.2792 -16.9810 -16.8260 -16.4155 -16.3354 -16.1607 -15.9715 -15.8493 -15.7495 -15.6470 -15.1961 -15.0906 -14.9405 -14.6797 -14.5305 -14.4302 -14.3733 -14.2168 -14.0732 -14.0554 -13.7562 -13.6312 -13.5891 -13.3987 -13.2592 -13.1826 -12.9861 -12.8548 -12.8227 -12.5949 -12.4217 -12.3272 -12.1978 -12.0849 -12.0395 -11.9587 -11.7199 -11.4046 -11.1547 -10.9702 -10.8333 -10.6049 -10.2011 -10.0816 -9.9788 -9.5265 -9.4994 -8.9752 -7.5191 -6.7659 1.0836 1.7096 1.7465 2.0990 2.3412 2.7510 3.0194 3.3733 3.5055 3.8459 3.9077 electronvolt
energy: -524.8219 -524.6079 -523.2155 -522.9740 -392.2214 -283.4498 -283.3051 -281.0710 -280.9008 -280.8367 -280.8012 -280.7648 -280.1118 -280.1002 -280.0888 -280.0609 -280.0263 -279.9349 -279.8718 -279.8309 -279.7642 -279.7447 -279.6850 -279.6621 -279.6426 -279.6291 -279.5946 -279.5663 -279.3927 -279.3868 -33.8060 -33.4604 -31.2045 -31.0013 -29.1676 -27.2865 -26.5752 -26.0090 -24.9372 -24.7354 -24.1288 -24.0514 -23.4326 -23.2209 -23.0362 -22.5331 -22.0539 -21.7512 -20.4433 -20.1388 -19.7244 -19.5930 -19.1016 -18.9045 -18.7268 -18.2585 -17.9695 -17.6126 -17.2259 -16.9229 -16.6603 -16.3434 -16.2622 -16.1251 -15.9014 -15.8330 -15.7291 -15.5193 -15.1326 -14.9847 -14.8828 -14.6565 -14.4309 -14.3630 -14.2284 -14.1507 -14.0270 -13.8868 -13.6650 -13.6060 -13.5244 -13.2683 -13.1249 -12.9979 -12.9253 -12.8192 -12.7613 -12.5000 -12.3196 -12.2676 -12.0349 -12.0007 -11.9515 -11.8181 -11.6088 -11.2989 -11.0965 -10.9584 -10.6997 -10.5638 -10.0781 -10.0562 -9.5134 -9.4445 -9.2269 -8.9448 -0.2314 0.7542 1.3031 1.7436 1.9090 2.1303 2.6762 3.0181 3.1699 3.4001 3.5240 electronvolt
chargesum: -0.0000000
charge: -0.427424 0.226934 -0.218457 -0.172078 -0.106172 0.166012 0.152906 -0.384659 0.002698 -0.296778 0.372812 0.260231 -0.257543 -0.233305 -0.372279 0.224612 -0.273168 -0.229948 -0.381266 0.151714 -0.010496 -0.113159 0.216861 -0.267638 -0.149864 -0.154019 -0.146510 -0.272459 -0.072988 -0.371942 0.135191 0.151760 0.144790 0.146908 0.150426 0.137390 0.142349 0.138785 -0.133581 0.124868 0.142834 0.139476 0.147167 0.134638 0.144918 0.143340 0.145976 0.150343 0.129481 0.122314 0.132503 0.120985 0.103464 0.145910 0.095140
charge: -0.258341 -0.240122 -0.126797 -0.083119 -0.081854 -0.164093 0.151487 -0.098183 -0.198839 -0.148893 -0.167216 -0.451954 0.266702 -0.301332 0.104185 -0.435292 0.262555 -0.296991 0.105707 -0.104035 -0.140574 -0.015451 -0.133438 -0.104807 -0.153467 -0.151306 -0.151856 -0.099646 -0.138876 0.192841 0.128025 0.134271 0.132882 0.152719 0.157456 0.148838 0.146190 0.149534 -0.229560 0.147991 0.154306 0.143117 0.117025 0.114070 0.115027 0.115934 0.117212 0.117829 0.176239 0.164385 0.148107 0.151809 0.164690 0.132034 0.162874
qa: -0.4274 0.2269 -0.2185 -0.1721 -0.1062 0.1660 0.1529 -0.3847 0.0027 -0.2968 0.3728 0.2602 -0.2575 -0.2333 -0.3723 0.2246 -0.2732 -0.2299 -0.3813 0.1517 -0.0105 -0.1132 0.2169 -0.2676 -0.1499 -0.1540 -0.1465 -0.2725 -0.0730 -0.3719 0.1352 0.1518 0.1448 0.1469 0.1504 0.1374 0.1423 0.1388 -0.1336 0.1249 0.1428 0.1395 0.1472 0.1346 0.1449 0.1433 0.1460 0.1503 0.1295 0.1223 0.1325 0.1210 0.1035 0.1459 0.0951
va: 3.8715 3.8218 3.9388 4.0036 4.0218 3.8845 0.9849 3.8862 4.0952 4.0389 3.5388 4.3145 2.0988 3.8814 2.1313 4.2648 2.1319 3.8659 2.1222 4.0825 4.1286 3.5604 3.5772 3.9575 3.9443 3.8766 3.9103 3.9921 4.0812 3.0143 0.9704 0.9649 0.9674 0.9710 0.9688 0.9700 0.9664 0.9699 3.9334 0.9665 0.9898 0.9728 0.9671 0.9645 0.9690 0.9669 0.9671 0.9663 0.9822 0.9580 0.9801 0.9657 0.9734 0.9777 0.9607
dispersion: -0.033234597 hartree
energy: -1323.453741817427 hartree
dipole: 0.439523553 -0.663526705 -0.224003152 2.630239130 -2.426057265 0.204181865 -1.352834039 1.117933284 -0.234900754
dipolemethod: SCF
magnitude: 0.383465788 au
magnitude: 0.974692573 debye
temp: 298.15 k
press: 1.00 atm
zeropoint: 0.45239112 hartree
thermalvibcorrection: 0.02376687 hartree
thermalrotcorrection: 0.00141627 hartree
thermaltrasncorrection: 0.00141627 hartree
thermaltotal: -1322.97475128 hartree
thermalcorr: 0.02659941 hartree
nonthermalcorr: 0.45239112 hartree
totalcorr: 0.47899053 hartree
thermalcorrenthalpy: 0.00094421 hartree
totalenthalpy: -1322.97380708 hartree
vibrat: 0.04243677 hartree
rotat: 0.01704480 hartree
transl: 0.02084687 hartree
total: 0.08136573 hartree
totalentropycorr: -0.08136573 hartree
gibbsenthalpy: -1323.05517280 hartree
gibbsminuselec: 0.39856902 hartree
