program: Orca
programVersion: 6.0.1
elementType: C C C C C C C C C C C C O C O C O C O C C C C C C C C C C N H H H H H H H H H H H H H H H H H H H H H H H H H
charge: 0
multiplicity: 1
keywords: UKS wB97X-D3 def2-TZVP def2/J RIJCOSX CPCM(Toluene) IRC
formula: C25H25NO4
InChI: InChI=1/C25H25NO4/c1-5-6-14-25(23(27)29-3,24(28)30-4)21-16-20(18-10-8-7-9-11-18)15-19-13-12-17(2)26-22(19)21/h5-13,15-16,21H,1,14H2,2-4H3
55 atoms
C  1.482557 4.914172 0.541119
C  0.464054 3.827067 0.366598
C  -0.836489 4.092148 -0.047396
C  -1.720152 3.041004 -0.193846
C  -1.297457 1.74098 0.058537
C  -2.202996 0.591787 -0.032024
C  -1.913102 0.027759 -2.183785
C  -1.298317 -1.207661 -2.093697
C  -0.049745 -1.41043 -1.520202
C  1.080004 -0.424704 -1.622202
C  1.734123 -0.181978 -0.26289
C  2.810998 0.902882 -0.367892
O  3.524833 0.968731 0.752342
C  4.513672 1.997161 0.807816
O  3.02071 1.569498 -1.344825
C  2.45626 -1.439026 0.239575
O  3.334942 -1.867174 -0.664803
C  4.116273 -3.007059 -0.295788
O  2.284773 -1.97261 1.302802
C  0.587581 0.185864 0.716301
C  -0.466118 -0.8952 0.644658
C  -1.818525 -0.602929 0.571638
C  -2.826286 -1.669333 0.771953
C  -4.120461 -1.351236 1.18858
C  -5.077768 -2.33649 1.365394
C  -4.762576 -3.666909 1.126763
C  -3.480871 -3.999661 0.715573
C  -2.523227 -3.012006 0.541064
C  0.032025 1.566977 0.446424
N  0.869925 2.582503 0.612808
H  1.037301 5.902754 0.434101
H  2.270982 4.805152 -0.207221
H  1.949732 4.840084 1.524259
H  -1.147449 5.110611 -0.243752
H  -2.745454 3.223172 -0.498213
H  -3.256099 0.825355 -0.129714
H  -1.328533 0.930617 -2.300947
H  -2.923662 0.083327 -2.571156
H  -1.935488 -2.082702 -2.185399
H  0.262594 -2.445952 -1.404557
H  0.734013 0.535797 -2.003021
H  1.824145 -0.793794 -2.329358
H  4.980928 1.905643 1.784213
H  4.037579 2.971931 0.702863
H  5.250628 1.860959 0.016861
H  3.469244 -3.859963 -0.094131
H  4.711447 -2.784306 0.589224
H  4.759997 -3.210093 -1.146766
H  1.013348 0.193454 1.723595
H  -0.171294 -1.828935 1.105136
H  -4.374448 -0.319024 1.399553
H  -6.072929 -2.064251 1.696778
H  -5.51053 -4.438573 1.264687
H  -3.223816 -5.034655 0.522935
H  -1.530876 -3.290736 0.209438
elementType: C O N H
totalener: -1323.41422740621329 hartree
nucrepener: 3052.65277412217938 hartree
electener: -4376.05360125609513 hartree
oneelecener: -7872.46787086043514 hartree
twoeener: 3496.41426960434046 hartree
cpcmener: -0.01343219605089 hartree
kineticenergy: 1317.64789211848165 hartree
xcener: -128.489613672818 hartree
s2: 0.000000
energy: -524.8834 -524.6838 -523.2534 -523.0478 -392.2964 -283.4940 -283.3614 -281.1016 -280.9411 -280.8690 -280.8401 -280.8217 -280.2850 -280.1210 -280.0997 -280.0693 -280.0299 -280.0227 -279.9720 -279.7998 -279.7839 -279.7731 -279.7384 -279.7339 -279.7213 -279.7165 -279.7049 -279.6976 -279.4041 -279.3514 -33.8551 -33.5372 -31.2564 -31.0739 -29.2281 -27.1251 -26.6650 -25.9310 -25.0883 -24.9620 -24.4918 -23.6809 -23.5392 -23.2733 -23.1686 -22.6870 -22.2809 -21.7624 -20.4895 -20.1693 -20.1054 -19.7370 -19.2863 -19.0487 -18.8400 -18.1435 -17.8714 -17.3516 -17.1984 -16.9653 -16.9117 -16.5147 -16.3415 -16.2464 -15.9973 -15.9219 -15.8275 -15.7483 -15.2223 -15.1182 -14.9292 -14.7708 -14.6655 -14.5154 -14.2614 -14.1744 -14.0483 -13.8436 -13.7870 -13.6765 -13.6469 -13.4217 -13.1824 -13.1004 -13.0082 -12.9129 -12.7990 -12.6171 -12.5939 -12.4387 -12.2746 -12.1765 -12.0936 -11.7659 -11.7236 -11.5184 -11.2089 -11.0391 -10.6935 -10.2868 -10.1272 -9.6894 -9.5810 -9.5542 -9.3194 -8.2071 -7.7749 0.4804 1.0818 1.1777 1.7000 2.0052 2.2463 2.6826 2.8935 3.0767 3.3929 3.5574 electronvolt
chargesum: -0.0000000
charge: -0.420449 0.216666 -0.202223 -0.171678 -0.081691 -0.162780 -0.330034 -0.102973 -0.206147 -0.304830 0.379510 0.242859 -0.252922 -0.234234 -0.366793 0.234178 -0.269600 -0.231110 -0.373759 0.419426 -0.538222 0.351438 0.112701 -0.251891 -0.154288 -0.139294 -0.154942 -0.263111 -0.091335 -0.363694 0.135108 0.150234 0.144073 0.147955 0.145903 0.158675 0.167057 0.142991 0.133474 0.145266 0.160387 0.156739 0.147911 0.137363 0.145586 0.144117 0.147278 0.151322 0.133148 0.192174 0.151154 0.139706 0.142237 0.139431 0.151930
charge: -0.258717 -0.239601 -0.126580 -0.080781 -0.122325 -0.070840 -0.168645 -0.222020 -0.135760 -0.183030 -0.173106 -0.449971 0.268447 -0.299226 0.108957 -0.437359 0.264090 -0.295476 0.111976 -0.127775 -0.061450 -0.135270 -0.101013 -0.104949 -0.145662 -0.147487 -0.145057 -0.104826 -0.138705 0.191571 0.128215 0.134645 0.132532 0.153242 0.157022 0.156828 0.133150 0.128265 0.148588 0.147631 0.157747 0.157858 0.117357 0.114640 0.115350 0.116151 0.117494 0.118092 0.184557 0.156310 0.153247 0.149059 0.148197 0.149236 0.155180
qa: -0.4204 0.2167 -0.2022 -0.1717 -0.0817 -0.1628 -0.3300 -0.1030 -0.2061 -0.3048 0.3795 0.2429 -0.2529 -0.2342 -0.3668 0.2342 -0.2696 -0.2311 -0.3738 0.4194 -0.5382 0.3514 0.1127 -0.2519 -0.1543 -0.1393 -0.1549 -0.2631 -0.0913 -0.3637 0.1351 0.1502 0.1441 0.1480 0.1459 0.1587 0.1671 0.1430 0.1335 0.1453 0.1604 0.1567 0.1479 0.1374 0.1456 0.1441 0.1473 0.1513 0.1331 0.1922 0.1512 0.1397 0.1422 0.1394 0.1519
va: 3.8711 3.8211 3.9233 4.0034 3.9381 3.7712 3.9416 3.9025 3.8524 4.0403 3.5827 4.3228 2.1181 3.8800 2.1377 4.2440 2.1340 3.8646 2.1294 3.7312 4.1897 3.3411 3.6450 4.0150 3.9051 3.8872 3.9363 3.9354 4.0768 3.0351 0.9700 0.9645 0.9696 0.9696 0.9744 0.9638 0.9585 0.9739 0.9679 0.9623 0.9772 0.9802 0.9672 0.9645 0.9684 0.9669 0.9668 0.9661 0.9880 0.9582 0.9699 0.9694 0.9658 0.9697 0.9757
dispersion: -0.035564337 hartree
energy: -1323.449791743353 hartree
dipole: 0.543123620 -0.739397632 -0.196274012 1.633280414 -1.509384518 0.123895896 -3.459005302 3.359869954 -0.099135348
dipolemethod: SCF
magnitude: 0.252391557 au
magnitude: 0.641528355 debye
temp: 298.15 k
press: 1.00 atm
zeropoint: 0.45174150 hartree
thermalvibcorrection: 0.02350965 hartree
thermalrotcorrection: 0.00141627 hartree
thermaltrasncorrection: 0.00141627 hartree
thermaltotal: -1322.97170805 hartree
thermalcorr: 0.02634219 hartree
nonthermalcorr: 0.45174150 hartree
totalcorr: 0.47808369 hartree
thermalcorrenthalpy: 0.00094421 hartree
totalenthalpy: -1322.97076384 hartree
vibrat: 0.04124952 hartree
rotat: 0.01704856 hartree
transl: 0.02084687 hartree
total: 0.07914496 hartree
totalentropycorr: -0.07914496 hartree
gibbsenthalpy: -1323.04990880 hartree
gibbsminuselec: 0.39988295 hartree
