program: Orca
programVersion: 6.0.1
charge: 0
multiplicity: 1
keywords: UKS wB97X-D3 def2-TZVP def2/J RIJCOSX CPCM(Toluene) NEB-TS TightSCF Freq
frequency: 0.00 0.00 0.00 0.00 0.00 0.00 -559.90 23.44 35.54 43.98 45.26 55.02 60.33 75.91 86.22 86.83 101.54 114.04 120.39 132.66 138.47 147.62 149.14 157.00 173.13 181.61 204.67 210.60 214.50 230.13 243.37 252.80 256.97 286.90 292.11 315.78 320.31 341.21 355.28 366.39 375.41 378.18 405.30 428.83 435.06 446.20 459.54 498.26 504.28 524.25 542.82 555.79 568.17 581.01 601.91 613.94 623.50 628.16 660.36 680.07 700.38 707.10 723.32 753.80 761.61 779.47 794.18 801.26 808.73 819.74 834.33 841.04 846.92 858.71 869.59 890.39 916.18 926.80 944.66 954.97 971.30 995.35 1001.96 1008.42 1008.98 1019.31 1025.10 1029.48 1037.78 1041.22 1057.51 1063.93 1067.21 1069.30 1093.02 1112.37 1116.19 1130.14 1133.81 1149.86 1157.98 1175.54 1179.30 1179.72 1186.81 1189.72 1204.43 1215.47 1219.73 1221.56 1244.86 1248.40 1276.75 1280.42 1285.15 1287.84 1294.39 1298.39 1300.77 1327.00 1332.30 1339.31 1346.10 1353.77 1356.33 1411.05 1443.14 1453.47 1473.12 1476.52 1478.51 1481.35 1483.16 1483.45 1487.19 1490.21 1490.69 1495.95 1502.71 1520.83 1531.14 1540.07 1578.73 1621.56 1652.85 1661.08 1679.58 1684.85 1807.07 1827.46 3064.68 3078.68 3080.48 3085.55 3101.80 3134.35 3142.07 3155.27 3160.09 3161.50 3163.81 3168.42 3177.90 3194.99 3195.14 3196.35 3205.39 3216.30 3219.67 3220.61 3235.29 3237.65 3241.24 3257.63
frequency: 23.44 35.54 43.98 45.26 55.02 60.33 75.91 86.22 86.83 101.54 114.04 120.39 132.66 138.47 147.62 149.14 157.00 173.13 181.61 204.67 210.60 214.50 230.13 243.37 252.80 256.97 286.90 292.11 315.78 320.31 341.21 355.28 366.39 375.41 378.18 405.30 428.83 435.06 446.20 459.54 498.26 504.28 524.25 542.82 555.79 568.17 581.01 601.91 613.94 623.50 628.16 660.36 680.07 700.38 707.10 723.32 753.80 761.61 779.47 794.18 801.26 808.73 819.74 834.33 841.04 846.92 858.71 869.59 890.39 916.18 926.80 944.66 954.97 971.30 995.35 1001.96 1008.42 1008.98 1019.31 1025.10 1029.48 1037.78 1041.22 1057.51 1063.93 1067.21 1069.30 1093.02 1112.37 1116.19 1130.14 1133.81 1149.86 1157.98 1175.54 1179.30 1179.72 1186.81 1189.72 1204.43 1215.47 1219.73 1221.56 1244.86 1248.40 1276.75 1280.42 1285.15 1287.84 1294.39 1298.39 1300.77 1327.00 1332.30 1339.31 1346.10 1353.77 1356.33 1411.05 1443.14 1453.47 1473.12 1476.52 1478.51 1481.35 1483.16 1483.45 1487.19 1490.21 1490.69 1495.95 1502.71 1520.83 1531.14 1540.07 1578.73 1621.56 1652.85 1661.08 1679.58 1684.85 1807.07 1827.46 3064.68 3078.68 3080.48 3085.55 3101.80 3134.35 3142.07 3155.27 3160.09 3161.50 3163.81 3168.42 3177.90 3194.99 3195.14 3196.35 3205.39 3216.30 3219.67 3220.61 3235.29 3237.65 3241.24 3257.63
formula: C26H24F3NO4
InChI: InChI=1/C26H24F3NO4/c1-5-6-13-25(23(31)33-3,24(32)34-4)21-15-18(14-17-12-11-16(2)30-22(17)21)19-9-7-8-10-20(19)26(27,28)29/h5-12,14-15,21H,1,13H2,2-4H3
58 atoms
C  1.739478 4.876129 0.398894
C  0.713185 3.798379 0.212849
C  -0.583131 4.077189 -0.205506
C  -1.474897 3.034834 -0.363702
C  -1.062622 1.730296 -0.119054
C  -1.982562 0.592109 -0.209975
C  -1.669643 0.059979 -2.374503
C  -1.066915 -1.179456 -2.290134
C  0.170119 -1.406653 -1.698363
C  1.316906 -0.439246 -1.783873
C  1.958257 -0.215915 -0.415782
C  3.047399 0.858698 -0.498169
O  3.74235 0.913483 0.634188
C  4.739866 1.932446 0.71011
O  3.281008 1.524888 -1.469928
C  2.661102 -1.484613 0.083981
O  3.555225 -1.906199 -0.808075
C  4.321395 -3.056594 -0.439498
O  2.462776 -2.032081 1.135401
C  0.802369 0.154872 0.548249
C  -0.262997 -0.91606 0.46196
C  -1.612025 -0.594761 0.413121
C  -2.623355 -1.647844 0.687643
C  -3.789547 -1.432777 1.441414
C  -4.715569 -2.454452 1.614366
C  -4.50248 -3.70829 1.068782
C  -3.335256 -3.950454 0.366559
C  -2.413259 -2.933333 0.186937
C  0.261345 1.542135 0.278059
N  1.107182 2.549156 0.454824
H  1.303316 5.868626 0.291071
H  2.533023 4.762406 -0.343295
H  2.197724 4.795359 1.385704
H  -0.885226 5.099639 -0.394598
H  -2.498062 3.226679 -0.668865
H  -3.030232 0.839553 -0.310558
H  -1.078093 0.961223 -2.46296
H  -2.673813 0.129322 -2.77587
H  -1.711723 -2.044239 -2.416191
H  0.467634 -2.448122 -1.59483
H  0.989593 0.528895 -2.161993
H  2.061669 -0.816283 -2.486066
H  5.19255 1.830871 1.692338
H  4.27379 2.91197 0.60447
H  5.48635 1.794365 -0.071489
H  3.665063 -3.909148 -0.268828
H  4.895454 -2.852408 0.463718
H  4.985286 -3.24834 -1.277486
H  1.210987 0.152932 1.562742
H  0.015293 -1.85534 0.923143
C  -4.08791 -0.124871 2.140976
H  -5.606228 -2.271599 2.199908
H  -5.235754 -4.491712 1.213109
H  -3.138288 -4.932288 -0.046855
H  -1.504318 -3.135971 -0.362237
F  -2.998193 0.46553 2.646516
F  -4.682093 0.774052 1.326621
F  -4.933503 -0.296963 3.171031
totalener: -1660.51698622078061 hartree
nucrepener: 3843.20935107934838 hartree
electener: -5503.71276108889197 hartree
oneelecener: -9919.95420155023567 hartree
twoeener: 4416.24144046134370 hartree
cpcmener: -0.01357294137902 hartree
kineticenergy: 1653.66873319664774 hartree
xcener: -154.530041564001 hartree
s2: 0.000000
dispersion: -0.038897667 hartree
dispersion: -0.038989739 hartree
s2: -0.000000
dispersion: -0.039017053 hartree
dispersion: -0.039016704 hartree
dispersion: -0.039021693 hartree
dispersion: -0.039021893 hartree
dispersion: -0.039024238 hartree
dispersion: -0.039018792 hartree
dispersion: -0.039028921 hartree
dispersion: -0.038995563 hartree
dispersion: -0.039070218 hartree
dispersion: -0.039000925 hartree
dispersion: -0.039045702 hartree
dispersion: -0.039035381 hartree
dispersion: -0.039042846 hartree
dispersion: -0.039050217 hartree
dispersion: -0.039055772 hartree
dispersion: -0.039073609 hartree
dispersion: -0.039063521 hartree
dispersion: -0.039072199 hartree
dispersion: -0.039063017 hartree
dispersion: -0.039077321 hartree
dispersion: -0.039092657 hartree
dispersion: -0.039079132 hartree
dispersion: -0.039089875 hartree
dispersion: -0.039064185 hartree
dispersion: -0.039093812 hartree
dispersion: -0.039105259 hartree
dispersion: -0.039080627 hartree
dispersion: -0.039062811 hartree
dispersion: -0.039085169 hartree
dispersion: -0.039074742 hartree
dispersion: -0.039082171 hartree
elementType: C O N H F
energy: -675.3185 -675.3100 -675.2824 -524.9109 -524.6989 -523.2836 -523.0625 -392.3045 -286.5999 -283.5239 -283.3811 -281.1261 -280.9499 -280.8963 -280.8569 -280.8283 -280.6332 -280.6029 -280.3344 -280.1890 -280.1525 -280.1215 -280.1055 -280.0931 -280.0857 -280.0844 -280.0111 -280.0087 -279.9465 -279.8198 -279.7815 -279.7626 -279.4564 -279.4011 -39.0864 -36.5832 -36.5186 -33.8814 -33.5551 -31.2863 -31.0907 -29.2421 -27.4624 -26.9177 -26.0343 -25.1394 -25.0450 -24.7416 -24.5636 -23.7653 -23.4616 -23.1954 -22.7600 -22.5082 -22.1659 -21.8050 -20.5517 -20.4198 -20.2618 -20.0262 -19.7096 -19.5189 -19.0985 -18.9084 -18.8700 -18.4357 -18.0962 -17.8975 -17.3250 -17.0785 -16.9594 -16.9289 -16.5182 -16.3496 -16.2328 -16.0014 -15.9536 -15.9013 -15.8554 -15.7842 -15.7602 -15.4539 -15.2623 -15.0227 -14.9540 -14.7933 -14.6343 -14.5515 -14.3917 -14.2967 -14.1106 -14.0322 -13.9126 -13.8617 -13.7754 -13.7130 -13.6558 -13.4649 -13.2414 -13.1942 -13.0632 -12.9306 -12.8817 -12.7481 -12.6664 -12.5616 -12.3522 -12.2666 -12.1905 -12.0946 -11.8147 -11.6460 -11.2418 -11.0522 -10.7239 -10.2879 -10.1541 -9.8817 -9.7354 -9.6139 -9.5431 -8.4332 -7.8574 0.4112 0.9807 1.0869 1.3081 1.9280 1.9874 2.4985 2.8638 3.0621 3.3635 3.6284 electronvolt
dispersion: -0.039083488 hartree
energy: -1660.560545542291 hartree
dipole: 29.982913755 -29.820504635 0.162409120 0.135854280 -0.909457709 -0.773603429 -18.911201893 18.289403506 -0.621798387
dipolemethod: SCF
magnitude: 1.005719753 au
magnitude: 2.556336457 debye
temp: 298.15 k
press: 1.00 atm
zeropoint: 0.45642673 hartree
thermalvibcorrection: 0.02713243 hartree
thermalrotcorrection: 0.00141627 hartree
thermaltrasncorrection: 0.00141627 hartree
thermaltotal: -1660.07415384 hartree
thermalcorr: 0.02996497 hartree
nonthermalcorr: 0.45642673 hartree
totalcorr: 0.48639170 hartree
thermalcorrenthalpy: 0.00094421 hartree
totalenthalpy: -1660.07320963 hartree
vibrat: 0.04813635 hartree
rotat: 0.01740312 hartree
transl: 0.02106745 hartree
total: 0.08660691 hartree
totalentropycorr: -0.08660691 hartree
gibbsenthalpy: -1660.15981654 hartree
gibbsminuselec: 0.40072900 hartree
